Date: Tue, 12 Mar 2013 18:14:39 +0400 From: awarecons <awarecons@gmail.com> To: ports-bugs@freebsd.org, gecko@FreeBSD.org Subject: www/firefox & seamonkey ISSUES config errors Message-ID: <CACGq7x0DAz5spTZ5EZDfjkJmoF7hs-Ly9tL0RhUc4eomXe=hTg@mail.gmail.com>
next in thread | raw e-mail | index | archive | help
[-- Attachment #1 --]
FreeBSD xxx 9.0-RELEASE-p5 FreeBSD 9.0-RELEASE-p5 #3: Sat Dec 29
20:04:22 MSK 2012 root@xxx:/sys/i386/compile/GENERIC i386
Upgrade firefox-19.0,1 to firefox-19.0.2,1:
checking for conic... checking for valid optimization flags... yes
checking size of int *... 0
configure: error: Unexpected pointer size
===> Script "../configure" failed unexpectedly.
Please report the problem to gecko@FreeBSD.org [maintainer] and attach the
"/usr/ports/www/firefox/work/mozilla-release/obj-i386-portbld-freebsd9.0/config.log"
including the output of the failure of your make command. Also, it might be
a good idea to provide an overview of all packages installed on your system
(e.g. a /usr/sbin/pkg_info -Ea).
*** Error code 1
Stop in /usr/ports/www/firefox.
*** Error code 1
Upgrade seamonkey-2.16 to seamonkey-2.16.1:
checking CAIRO_XRENDER_LIBS... -lcairo -pthread -lXrender
-L/usr/local/lib -lX11
configure: error: Could not compile basic X program.
===> Script "../configure" failed unexpectedly.
Please report the problem to gecko@FreeBSD.org [maintainer] and attach the
"/usr/ports/www/seamonkey/work/comm-release/obj-i386-portbld-freebsd9.0/config.log"
including the output of the failure of your make command. Also, it might be
a good idea to provide an overview of all packages installed on your system
(e.g. a /usr/sbin/pkg_info -Ea).
*** Error code 1
Stop in /usr/ports/www/seamonkey.
*** Error code 1
---
Silently fails, when without USE_GCC/clang directive set, either in
Makefile or make.conf, or via ENV.
It would be wise to warn via make message and/or ../ports/UPDATING,
that both are capable with gcc 4.6+ and clang 3.2+ (as it appears from
logs attached world's clang 3.0 fails).
Thank you.
[-- Attachment #2 --]
This file contains any messages produced by compilers while
running configure, to aid debugging if configure makes a mistake.
configure:1113: checking host system type
configure:1134: checking target system type
configure:1152: checking build system type
configure:1229: checking for mawk
configure:1229: checking for gawk
configure:1300: checking for /usr/local/bin/python2.7
configure:1551: checking for /usr/local/bin/perl
configure:2856: checking for gcc
configure:2969: checking whether the C compiler (clang -O2 -pipe -march=pentium4 -mtune=pentium4 -fno-strict-aliasing -L/usr/local/lib -L/usr/local/lib -Wl,-z,origin -Wl,-rpath,\$$ORIGIN) works
configure:2985: clang -o conftest -O2 -pipe -march=pentium4 -mtune=pentium4 -fno-strict-aliasing -O2 -pipe -march=pentium4 -mtune=pentium4 -Wno-error -w -isystem/usr/local/include -L/usr/local/lib -L/usr/local/lib -Wl,-z,origin -Wl,-rpath,\$$ORIGIN conftest.c 1>&5
configure:3011: checking whether the C compiler (clang -O2 -pipe -march=pentium4 -mtune=pentium4 -fno-strict-aliasing -L/usr/local/lib -L/usr/local/lib -Wl,-z,origin -Wl,-rpath,\$$ORIGIN) is a cross-compiler
configure:3016: checking whether we are using GNU C
configure:3025: clang -E conftest.c
configure:3044: checking whether clang accepts -g
configure:3085: checking for c++
configure:3117: checking whether the C++ compiler (clang++ -O2 -pipe -march=pentium4 -mtune=pentium4 -fno-strict-aliasing -O2 -pipe -march=pentium4 -mtune=pentium4 -Wno-error -w -L/usr/local/lib -L/usr/local/lib -Wl,-z,origin -Wl,-rpath,\$$ORIGIN) works
configure:3133: clang++ -o conftest -O2 -pipe -march=pentium4 -mtune=pentium4 -fno-strict-aliasing -O2 -pipe -march=pentium4 -mtune=pentium4 -Wno-error -w -O2 -pipe -march=pentium4 -mtune=pentium4 -Wno-error -w -isystem/usr/local/include -L/usr/local/lib -L/usr/local/lib -Wl,-z,origin -Wl,-rpath,\$$ORIGIN conftest.C 1>&5
configure:3159: checking whether the C++ compiler (clang++ -O2 -pipe -march=pentium4 -mtune=pentium4 -fno-strict-aliasing -O2 -pipe -march=pentium4 -mtune=pentium4 -Wno-error -w -L/usr/local/lib -L/usr/local/lib -Wl,-z,origin -Wl,-rpath,\$$ORIGIN) is a cross-compiler
configure:3164: checking whether we are using GNU C++
configure:3173: clang++ -E conftest.C
configure:3192: checking whether clang++ accepts -g
configure:3226: checking for ranlib
configure:3258: checking for as
configure:3312: checking for ar
configure:3347: checking for ld
configure:3382: checking for strip
configure:3417: checking for windres
configure:4282: checking how to run the C preprocessor
configure:4362: checking how to run the C++ preprocessor
configure:4380: clang++ -E -O2 -pipe -march=pentium4 -mtune=pentium4 -Wno-error -w -isystem/usr/local/include conftest.C >/dev/null 2>conftest.out
configure:4464: checking for a BSD compatible install
configure:4517: checking whether ln -s works
configure:4540: checking for minimum required perl version >= 5.006
configure:4551: checking for full perl installation
configure:4588: checking for doxygen
configure:4637: checking for autoconf
configure:4688: checking for unzip
configure:4744: checking for zip
configure:4798: checking for xargs
configure:4850: checking for rpmbuild
configure:5129: checking compiler version
configure:5203: checking for gmake
configure:5270: checking for X
configure:5587: checking for dnet_ntoa in -ldnet
configure:5606: clang -o conftest -O2 -pipe -march=pentium4 -mtune=pentium4 -fno-strict-aliasing -O2 -pipe -march=pentium4 -mtune=pentium4 -Wno-error -w -isystem/usr/local/include -L/usr/local/lib -L/usr/local/lib -Wl,-z,origin -Wl,-rpath,\$$ORIGIN conftest.c -ldnet 1>&5
/usr/bin/ld: cannot find -ldnet
clang: error: linker command failed with exit code 1 (use -v to see invocation)
configure: failed program was:
#line 5595 "configure"
#include "confdefs.h"
/* Override any gcc2 internal prototype to avoid an error. */
/* We use char because int might match the return type of a gcc2
builtin and then its argument prototype would still apply. */
char dnet_ntoa();
int main() {
dnet_ntoa()
; return 0; }
configure:5628: checking for dnet_ntoa in -ldnet_stub
configure:5647: clang -o conftest -O2 -pipe -march=pentium4 -mtune=pentium4 -fno-strict-aliasing -O2 -pipe -march=pentium4 -mtune=pentium4 -Wno-error -w -isystem/usr/local/include -L/usr/local/lib -L/usr/local/lib -Wl,-z,origin -Wl,-rpath,\$$ORIGIN conftest.c -ldnet_stub 1>&5
/usr/bin/ld: cannot find -ldnet_stub
clang: error: linker command failed with exit code 1 (use -v to see invocation)
configure: failed program was:
#line 5636 "configure"
#include "confdefs.h"
/* Override any gcc2 internal prototype to avoid an error. */
/* We use char because int might match the return type of a gcc2
builtin and then its argument prototype would still apply. */
char dnet_ntoa();
int main() {
dnet_ntoa()
; return 0; }
configure:5676: checking for gethostbyname
configure:5704: clang -o conftest -O2 -pipe -march=pentium4 -mtune=pentium4 -fno-strict-aliasing -O2 -pipe -march=pentium4 -mtune=pentium4 -Wno-error -w -isystem/usr/local/include -L/usr/local/lib -L/usr/local/lib -Wl,-z,origin -Wl,-rpath,\$$ORIGIN conftest.c 1>&5
configure:5774: checking for connect
configure:5802: clang -o conftest -O2 -pipe -march=pentium4 -mtune=pentium4 -fno-strict-aliasing -O2 -pipe -march=pentium4 -mtune=pentium4 -Wno-error -w -isystem/usr/local/include -L/usr/local/lib -L/usr/local/lib -Wl,-z,origin -Wl,-rpath,\$$ORIGIN conftest.c 1>&5
configure:5866: checking for remove
configure:5894: clang -o conftest -O2 -pipe -march=pentium4 -mtune=pentium4 -fno-strict-aliasing -O2 -pipe -march=pentium4 -mtune=pentium4 -Wno-error -w -isystem/usr/local/include -L/usr/local/lib -L/usr/local/lib -Wl,-z,origin -Wl,-rpath,\$$ORIGIN conftest.c 1>&5
configure:5958: checking for shmat
configure:5986: clang -o conftest -O2 -pipe -march=pentium4 -mtune=pentium4 -fno-strict-aliasing -O2 -pipe -march=pentium4 -mtune=pentium4 -Wno-error -w -isystem/usr/local/include -L/usr/local/lib -L/usr/local/lib -Wl,-z,origin -Wl,-rpath,\$$ORIGIN conftest.c 1>&5
configure:6059: checking for IceConnectionNumber in -lICE
configure:6078: clang -o conftest -O2 -pipe -march=pentium4 -mtune=pentium4 -fno-strict-aliasing -O2 -pipe -march=pentium4 -mtune=pentium4 -Wno-error -w -isystem/usr/local/include -L/usr/local/lib -L/usr/local/lib -Wl,-z,origin -Wl,-rpath,\$$ORIGIN -L/usr/local/lib conftest.c -lICE 1>&5
configure:6486: clang -c -O2 -pipe -march=pentium4 -mtune=pentium4 -Wno-error -w -isystem/usr/local/include conftest.c 1>&5
configure:6482:15: error: use of undeclared identifier '__thumb2__'
return sizeof(__thumb2__);
^
1 error generated.
configure: failed program was:
#line 6479 "configure"
#include "confdefs.h"
int main() {
return sizeof(__thumb2__);
; return 0; }
configure:6680: checking that static assertion macros used in autoconf tests work
configure:6701: clang -c -O2 -pipe -march=pentium4 -mtune=pentium4 -fno-strict-aliasing -O2 -pipe -march=pentium4 -mtune=pentium4 -Wno-error -w -isystem/usr/local/include conftest.c 1>&5
configure:6718: clang -c -O2 -pipe -march=pentium4 -mtune=pentium4 -fno-strict-aliasing -O2 -pipe -march=pentium4 -mtune=pentium4 -Wno-error -w -isystem/usr/local/include conftest.c 1>&5
configure:6718:1: error: 'static_assert_line_6718' declared as an array with a negative size
CONFIGURE_STATIC_ASSERT(0)
^~~~~~~~~~~~~~~~~~~~~~~~~~
configure:6713:44: note: expanded from:
#define CONFIGURE_STATIC_ASSERT(condition) CONFIGURE_STATIC_ASSERT_IMPL(condition, __LINE__)
^
configure:6714:55: note: expanded from:
#define CONFIGURE_STATIC_ASSERT_IMPL(condition, line) CONFIGURE_STATIC_ASSERT_IMPL2(condition, line)
^
configure:6715:94: note: expanded from:
#define CONFIGURE_STATIC_ASSERT_IMPL2(condition, line) typedef int static_assert_line_##line[(condition) ? 1 : -1]
^~~~~~~~~~~~~~~~~~~~
1 error generated.
configure: failed program was:
#line 6711 "configure"
#include "confdefs.h"
#define CONFIGURE_STATIC_ASSERT(condition) CONFIGURE_STATIC_ASSERT_IMPL(condition, __LINE__)
#define CONFIGURE_STATIC_ASSERT_IMPL(condition, line) CONFIGURE_STATIC_ASSERT_IMPL2(condition, line)
#define CONFIGURE_STATIC_ASSERT_IMPL2(condition, line) typedef int static_assert_line_##line[(condition) ? 1 : -1]
int main() {
CONFIGURE_STATIC_ASSERT(0)
; return 0; }
configure:6741: clang++ -c -O2 -pipe -march=pentium4 -mtune=pentium4 -fno-strict-aliasing -O2 -pipe -march=pentium4 -mtune=pentium4 -Wno-error -w -O2 -pipe -march=pentium4 -mtune=pentium4 -Wno-error -w -isystem/usr/local/include conftest.C 1>&5
configure:6758: clang++ -c -O2 -pipe -march=pentium4 -mtune=pentium4 -fno-strict-aliasing -O2 -pipe -march=pentium4 -mtune=pentium4 -Wno-error -w -O2 -pipe -march=pentium4 -mtune=pentium4 -Wno-error -w -isystem/usr/local/include conftest.C 1>&5
configure:6758:1: error: 'static_assert_line_6758' declared as an array with a negative size
CONFIGURE_STATIC_ASSERT(0)
^~~~~~~~~~~~~~~~~~~~~~~~~~
configure:6753:44: note: expanded from:
#define CONFIGURE_STATIC_ASSERT(condition) CONFIGURE_STATIC_ASSERT_IMPL(condition, __LINE__)
^
configure:6754:55: note: expanded from:
#define CONFIGURE_STATIC_ASSERT_IMPL(condition, line) CONFIGURE_STATIC_ASSERT_IMPL2(condition, line)
^
configure:6755:94: note: expanded from:
#define CONFIGURE_STATIC_ASSERT_IMPL2(condition, line) typedef int static_assert_line_##line[(condition) ? 1 : -1]
^~~~~~~~~~~~~~~~~~~~
1 error generated.
configure: failed program was:
#line 6751 "configure"
#include "confdefs.h"
#define CONFIGURE_STATIC_ASSERT(condition) CONFIGURE_STATIC_ASSERT_IMPL(condition, __LINE__)
#define CONFIGURE_STATIC_ASSERT_IMPL(condition, line) CONFIGURE_STATIC_ASSERT_IMPL2(condition, line)
#define CONFIGURE_STATIC_ASSERT_IMPL2(condition, line) typedef int static_assert_line_##line[(condition) ? 1 : -1]
int main() {
CONFIGURE_STATIC_ASSERT(0)
; return 0; }
configure:6917: checking for --noexecstack option to as
configure:6928: clang -c -O2 -pipe -march=pentium4 -mtune=pentium4 -fno-strict-aliasing -fno-strict-aliasing -Wa,--noexecstack -Qunused-arguments -O2 -pipe -march=pentium4 -mtune=pentium4 -Wno-error -w -isystem/usr/local/include conftest.c 1>&5
configure:6941: checking for -z noexecstack option to ld
configure:6952: clang -o conftest -O2 -pipe -march=pentium4 -mtune=pentium4 -fno-strict-aliasing -fno-strict-aliasing -Qunused-arguments -O2 -pipe -march=pentium4 -mtune=pentium4 -Wno-error -w -isystem/usr/local/include -L/usr/local/lib -L/usr/local/lib -Wl,-z,origin -Wl,-rpath,\$$ORIGIN -Wl,-z,noexecstack conftest.c 1>&5
configure:6966: checking if toolchain supports -mmmx -mssse3 option
configure:6978: clang -c -O2 -pipe -march=pentium4 -mtune=pentium4 -fno-strict-aliasing -fno-strict-aliasing -mmmx -mssse3 -Qunused-arguments -O2 -pipe -march=pentium4 -mtune=pentium4 -Wno-error -w -isystem/usr/local/include conftest.c 1>&5
configure:6994: checking if toolchain supports -mmmx -msse4.1 option
configure:7006: clang -c -O2 -pipe -march=pentium4 -mtune=pentium4 -fno-strict-aliasing -fno-strict-aliasing -mmmx -msse4.1 -Qunused-arguments -O2 -pipe -march=pentium4 -mtune=pentium4 -Wno-error -w -isystem/usr/local/include conftest.c 1>&5
configure:7032: checking whether the C compiler supports -Werror=return-type
configure:7055: clang -c -O2 -pipe -march=pentium4 -mtune=pentium4 -fno-strict-aliasing -fno-strict-aliasing -Werror -Werror=return-type -Qunused-arguments -O2 -pipe -march=pentium4 -mtune=pentium4 -Wno-error -w -isystem/usr/local/include conftest.c 1>&5
configure:7083: checking whether the C compiler supports -Wtype-limits
configure:7106: clang -c -O2 -pipe -march=pentium4 -mtune=pentium4 -fno-strict-aliasing -fno-strict-aliasing -Werror -Wtype-limits -Qunused-arguments -O2 -pipe -march=pentium4 -mtune=pentium4 -Wno-error -w -isystem/usr/local/include conftest.c 1>&5
configure:7134: checking whether the C compiler supports -Wempty-body
configure:7157: clang -c -O2 -pipe -march=pentium4 -mtune=pentium4 -fno-strict-aliasing -fno-strict-aliasing -Werror -Wempty-body -Qunused-arguments -O2 -pipe -march=pentium4 -mtune=pentium4 -Wno-error -w -isystem/usr/local/include conftest.c 1>&5
configure:7191: checking whether the C compiler supports -Wno-overlength-strings
configure:7214: clang -c -O2 -pipe -march=pentium4 -mtune=pentium4 -fno-strict-aliasing -fno-strict-aliasing -Werror -Woverlength-strings -Qunused-arguments -O2 -pipe -march=pentium4 -mtune=pentium4 -Wno-error -w -isystem/usr/local/include conftest.c 1>&5
configure:7298: checking whether the C++ compiler supports -Werror=return-type
configure:7321: clang++ -c -O2 -pipe -march=pentium4 -mtune=pentium4 -fno-strict-aliasing -O2 -pipe -march=pentium4 -mtune=pentium4 -Wno-error -w -fno-exceptions -fno-strict-aliasing -Werror -Werror=return-type -Qunused-arguments -O2 -pipe -march=pentium4 -mtune=pentium4 -Wno-error -w -isystem/usr/local/include conftest.C 1>&5
configure:7349: checking whether the C++ compiler supports -Wtype-limits
configure:7372: clang++ -c -O2 -pipe -march=pentium4 -mtune=pentium4 -fno-strict-aliasing -O2 -pipe -march=pentium4 -mtune=pentium4 -Wno-error -w -fno-exceptions -fno-strict-aliasing -Werror -Wtype-limits -Qunused-arguments -O2 -pipe -march=pentium4 -mtune=pentium4 -Wno-error -w -isystem/usr/local/include conftest.C 1>&5
configure:7400: checking whether the C++ compiler supports -Wempty-body
configure:7423: clang++ -c -O2 -pipe -march=pentium4 -mtune=pentium4 -fno-strict-aliasing -O2 -pipe -march=pentium4 -mtune=pentium4 -Wno-error -w -fno-exceptions -fno-strict-aliasing -Werror -Wempty-body -Qunused-arguments -O2 -pipe -march=pentium4 -mtune=pentium4 -Wno-error -w -isystem/usr/local/include conftest.C 1>&5
configure:7459: checking whether the C++ compiler supports -Wno-overlength-strings
configure:7482: clang++ -c -O2 -pipe -march=pentium4 -mtune=pentium4 -fno-strict-aliasing -O2 -pipe -march=pentium4 -mtune=pentium4 -Wno-error -w -fno-exceptions -fno-strict-aliasing -Werror -Woverlength-strings -Qunused-arguments -O2 -pipe -march=pentium4 -mtune=pentium4 -Wno-error -w -isystem/usr/local/include conftest.C 1>&5
configure:7510: checking whether the C++ compiler supports -Wno-invalid-offsetof
configure:7533: clang++ -c -O2 -pipe -march=pentium4 -mtune=pentium4 -fno-strict-aliasing -O2 -pipe -march=pentium4 -mtune=pentium4 -Wno-error -w -fno-exceptions -fno-strict-aliasing -Werror -Winvalid-offsetof -Qunused-arguments -O2 -pipe -march=pentium4 -mtune=pentium4 -Wno-error -w -isystem/usr/local/include conftest.C 1>&5
configure:7561: checking whether the C++ compiler supports -Wno-variadic-macros
configure:7584: clang++ -c -O2 -pipe -march=pentium4 -mtune=pentium4 -fno-strict-aliasing -O2 -pipe -march=pentium4 -mtune=pentium4 -Wno-error -w -fno-exceptions -fno-strict-aliasing -Werror -Wvariadic-macros -Qunused-arguments -O2 -pipe -march=pentium4 -mtune=pentium4 -Wno-error -w -isystem/usr/local/include conftest.C 1>&5
configure:7636: checking whether the C++ compiler supports -Wno-extended-offsetof
configure:7659: clang++ -c -O2 -pipe -march=pentium4 -mtune=pentium4 -fno-strict-aliasing -O2 -pipe -march=pentium4 -mtune=pentium4 -Wno-error -w -fno-exceptions -fno-strict-aliasing -Werror -Wextended-offsetof -Qunused-arguments -O2 -pipe -march=pentium4 -mtune=pentium4 -Wno-error -w -isystem/usr/local/include conftest.C 1>&5
configure:7697: checking whether ld has archive extraction flags
configure:7721: clang -o conftest -O2 -pipe -march=pentium4 -mtune=pentium4 -fno-strict-aliasing -fno-strict-aliasing -Qunused-arguments -O2 -pipe -march=pentium4 -mtune=pentium4 -Wno-error -w -isystem/usr/local/include -Wl,--whole-archive conftest.c -Wl,--no-whole-archive 1>&5
configure:7756: checking for 64-bit OS
configure:7765: clang -c -O2 -pipe -march=pentium4 -mtune=pentium4 -fno-strict-aliasing -fno-strict-aliasing -Qunused-arguments -O2 -pipe -march=pentium4 -mtune=pentium4 -Wno-error -w -isystem/usr/local/include conftest.c 1>&5
configure:7765:1: error: 'static_assert_line_7765' declared as an array with a negative size
CONFIGURE_STATIC_ASSERT(sizeof(void*) == 8)
^~~~~~~~~~~~~~~~~~~~~~~~~~~~~~~~~~~~~~~~~~~
configure:7760:44: note: expanded from:
#define CONFIGURE_STATIC_ASSERT(condition) CONFIGURE_STATIC_ASSERT_IMPL(condition, __LINE__)
^
configure:7761:55: note: expanded from:
#define CONFIGURE_STATIC_ASSERT_IMPL(condition, line) CONFIGURE_STATIC_ASSERT_IMPL2(condition, line)
^
configure:7762:94: note: expanded from:
#define CONFIGURE_STATIC_ASSERT_IMPL2(condition, line) typedef int static_assert_line_##line[(condition) ? 1 : -1]
^~~~~~~~~~~~~~~~~~~~
1 error generated.
configure: failed program was:
#line 7758 "configure"
#include "confdefs.h"
#define CONFIGURE_STATIC_ASSERT(condition) CONFIGURE_STATIC_ASSERT_IMPL(condition, __LINE__)
#define CONFIGURE_STATIC_ASSERT_IMPL(condition, line) CONFIGURE_STATIC_ASSERT_IMPL2(condition, line)
#define CONFIGURE_STATIC_ASSERT_IMPL2(condition, line) typedef int static_assert_line_##line[(condition) ? 1 : -1]
int main() {
CONFIGURE_STATIC_ASSERT(sizeof(void*) == 8)
; return 0; }
configure:8231: checking for custom <stdint.h> implementation
configure:9543: checking whether the linker supports Identical Code Folding
configure:9552: clang -o conftest -L/usr/local/lib -L/usr/local/lib -Wl,-z,origin -Wl,-rpath,\$$ORIGIN -Wl,-z,noexecstack -Wl,--icf=safe -ffunction-sections conftest.c 1>&2
/usr/bin/ld: unrecognized option '--icf=safe'
/usr/bin/ld: use the --help option for usage information
clang: error: linker command failed with exit code 1 (use -v to see invocation)
configure:9623: checking for ANSI C header files
configure:9636: clang-cpp -Qunused-arguments -O2 -pipe -march=pentium4 -mtune=pentium4 -Wno-error -w -isystem/usr/local/include conftest.c >/dev/null 2>conftest.out
configure:9703: clang -o conftest -O2 -pipe -march=pentium4 -mtune=pentium4 -fno-strict-aliasing -fno-strict-aliasing -ffunction-sections -fdata-sections -Qunused-arguments -O2 -pipe -march=pentium4 -mtune=pentium4 -Wno-error -w -isystem/usr/local/include -L/usr/local/lib -L/usr/local/lib -Wl,-z,origin -Wl,-rpath,\$$ORIGIN -Wl,-z,noexecstack conftest.c 1>&5
configure:9730: checking for working const
configure:9784: clang -c -O2 -pipe -march=pentium4 -mtune=pentium4 -fno-strict-aliasing -fno-strict-aliasing -ffunction-sections -fdata-sections -Qunused-arguments -O2 -pipe -march=pentium4 -mtune=pentium4 -Wno-error -w -isystem/usr/local/include conftest.c 1>&5
configure:9808: checking for mode_t
configure:9844: checking for off_t
configure:9880: checking for pid_t
configure:9916: checking for size_t
configure:9959: checking for __stdcall
configure:9973: clang++ -c -O2 -pipe -march=pentium4 -mtune=pentium4 -fno-strict-aliasing -O2 -pipe -march=pentium4 -mtune=pentium4 -Wno-error -w -fno-exceptions -fno-strict-aliasing -fno-rtti -ffunction-sections -fdata-sections -fno-exceptions -Qunused-arguments -O2 -pipe -march=pentium4 -mtune=pentium4 -Wno-error -w -isystem/usr/local/include conftest.C 1>&5
configure:10005: checking for ssize_t
configure:10018: clang -c -O2 -pipe -march=pentium4 -mtune=pentium4 -fno-strict-aliasing -fno-strict-aliasing -ffunction-sections -fdata-sections -Qunused-arguments -O2 -pipe -march=pentium4 -mtune=pentium4 -Wno-error -w -isystem/usr/local/include conftest.c 1>&5
configure:10043: checking for st_blksize in struct stat
configure:10056: clang -c -O2 -pipe -march=pentium4 -mtune=pentium4 -fno-strict-aliasing -fno-strict-aliasing -ffunction-sections -fdata-sections -Qunused-arguments -O2 -pipe -march=pentium4 -mtune=pentium4 -Wno-error -w -isystem/usr/local/include conftest.c 1>&5
configure:10080: checking for siginfo_t
configure:10093: clang -c -O2 -pipe -march=pentium4 -mtune=pentium4 -fno-strict-aliasing -fno-strict-aliasing -ffunction-sections -fdata-sections -Qunused-arguments -O2 -pipe -march=pentium4 -mtune=pentium4 -Wno-error -w -isystem/usr/local/include conftest.c 1>&5
Stack dump:
0. Program arguments: /usr/bin/clang -cc1 -triple i386-unknown-freebsd9.0 -emit-obj -disable-free -main-file-name conftest.c -mrelocation-model static -mdisable-fp-elim -relaxed-aliasing -masm-verbose -mconstructor-aliases -target-cpu pentium4 -momit-leaf-frame-pointer -ffunction-sections -fdata-sections -coverage-file conftest.o -resource-dir /usr/bin/../lib/clang/3.0 -isystem /usr/local/include -fmodule-cache-path /tmp/clang-module-cache -O2 -Wno-error -w -ferror-limit 19 -fmessage-length 0 -fgnu-runtime -fobjc-runtime-has-arc -fobjc-runtime-has-weak -fobjc-fragile-abi -fdiagnostics-show-option -o conftest.o -x c conftest.c
1. <eof> parser at end of file
2. configure:10088:5: LLVM IR generation of declaration 'main'
3. configure:10088:5: Generating code for declaration 'main'
4. configure:10088:12: LLVM IR generation of compound statement ('{}')
clang: error: unable to execute command: Illegal instruction: 4 (core dumped)
clang: error: clang frontend command failed due to signal 2 (use -v to see invocation)
clang: note: diagnostic msg: Please submit a bug report to http://llvm.org/bugs/ and include command line arguments and all diagnostic information.
clang: note: diagnostic msg: Preprocessed source(s) are located at:
clang: note: diagnostic msg: /tmp/conftest-9l7RGz.i
configure: failed program was:
#line 10085 "configure"
#include "confdefs.h"
#define _POSIX_C_SOURCE 199506L
#include <signal.h>
int main() {
siginfo_t* info;
; return 0; }
configure:10119: checking for int64
configure:10132: clang -c -O2 -pipe -march=pentium4 -mtune=pentium4 -fno-strict-aliasing -fno-strict-aliasing -ffunction-sections -fdata-sections -Qunused-arguments -O2 -pipe -march=pentium4 -mtune=pentium4 -Wno-error -w -isystem/usr/local/include conftest.c 1>&5
configure:10128:1: error: use of undeclared identifier 'int64'
int64 foo = 0;
^
1 error generated.
configure: failed program was:
#line 10124 "configure"
#include "confdefs.h"
#include <stdio.h>
#include <sys/types.h>
int main() {
int64 foo = 0;
; return 0; }
configure:10157: checking for uint
configure:10170: clang -c -O2 -pipe -march=pentium4 -mtune=pentium4 -fno-strict-aliasing -fno-strict-aliasing -ffunction-sections -fdata-sections -Qunused-arguments -O2 -pipe -march=pentium4 -mtune=pentium4 -Wno-error -w -isystem/usr/local/include conftest.c 1>&5
configure:10195: checking for uint_t
configure:10208: clang -c -O2 -pipe -march=pentium4 -mtune=pentium4 -fno-strict-aliasing -fno-strict-aliasing -ffunction-sections -fdata-sections -Qunused-arguments -O2 -pipe -march=pentium4 -mtune=pentium4 -Wno-error -w -isystem/usr/local/include conftest.c 1>&5
configure:10204:1: error: unknown type name 'uint_t'; did you mean 'uint8_t'?
uint_t foo = 0;
^~~~~~
uint8_t
/usr/include/sys/_stdint.h:54:20: note: 'uint8_t' declared here
typedef __uint8_t uint8_t;
^
1 error generated.
configure: failed program was:
#line 10200 "configure"
#include "confdefs.h"
#include <stdio.h>
#include <sys/types.h>
int main() {
uint_t foo = 0;
; return 0; }
configure:10242: checking for uname.domainname
configure:10255: clang++ -c -O2 -pipe -march=pentium4 -mtune=pentium4 -fno-strict-aliasing -O2 -pipe -march=pentium4 -mtune=pentium4 -Wno-error -w -fno-exceptions -fno-strict-aliasing -fno-rtti -ffunction-sections -fdata-sections -fno-exceptions -Qunused-arguments -O2 -pipe -march=pentium4 -mtune=pentium4 -Wno-error -w -isystem/usr/local/include conftest.C 1>&5
configure:10251:62: error: no member named 'domainname' in 'utsname'
(void)uname(res); if (res != 0) { domain = res->domainname; }
~~~ ^
1 error generated.
configure: failed program was:
#line 10247 "configure"
#include "confdefs.h"
#include <sys/utsname.h>
int main() {
struct utsname *res; char *domain;
(void)uname(res); if (res != 0) { domain = res->domainname; }
; return 0; }
configure:10282: checking for uname.__domainname
configure:10295: clang++ -c -O2 -pipe -march=pentium4 -mtune=pentium4 -fno-strict-aliasing -O2 -pipe -march=pentium4 -mtune=pentium4 -Wno-error -w -fno-exceptions -fno-strict-aliasing -fno-rtti -ffunction-sections -fdata-sections -fno-exceptions -Qunused-arguments -O2 -pipe -march=pentium4 -mtune=pentium4 -Wno-error -w -isystem/usr/local/include conftest.C 1>&5
configure:10291:62: error: no member named '__domainname' in 'utsname'
(void)uname(res); if (res != 0) { domain = res->__domainname; }
~~~ ^
1 error generated.
configure: failed program was:
#line 10287 "configure"
#include "confdefs.h"
#include <sys/utsname.h>
int main() {
struct utsname *res; char *domain;
(void)uname(res); if (res != 0) { domain = res->__domainname; }
; return 0; }
configure:10334: checking for gcc c++0x headers bug without rtti
configure:10346: clang++ -c -O2 -pipe -march=pentium4 -mtune=pentium4 -fno-strict-aliasing -O2 -pipe -march=pentium4 -mtune=pentium4 -Wno-error -w -fno-exceptions -fno-strict-aliasing -fno-rtti -ffunction-sections -fdata-sections -fno-exceptions -std=gnu++0x -Qunused-arguments -O2 -pipe -march=pentium4 -mtune=pentium4 -Wno-error -w -isystem/usr/local/include conftest.C 1>&5
configure:10366: checking for usable char16_t (2 bytes, unsigned)
configure:10382: clang++ -c -O2 -pipe -march=pentium4 -mtune=pentium4 -fno-strict-aliasing -O2 -pipe -march=pentium4 -mtune=pentium4 -Wno-error -w -fno-exceptions -fno-strict-aliasing -fno-rtti -ffunction-sections -fdata-sections -fno-exceptions -std=gnu++0x -Qunused-arguments -O2 -pipe -march=pentium4 -mtune=pentium4 -Wno-error -w -isystem/usr/local/include conftest.C 1>&5
configure:10410: checking for usable wchar_t (2 bytes, unsigned)
configure:10424: clang++ -c -O2 -pipe -march=pentium4 -mtune=pentium4 -fno-strict-aliasing -O2 -pipe -march=pentium4 -mtune=pentium4 -Wno-error -w -fno-exceptions -fno-strict-aliasing -fno-rtti -ffunction-sections -fdata-sections -fno-exceptions -std=gnu++0x -Qunused-arguments -O2 -pipe -march=pentium4 -mtune=pentium4 -Wno-error -w -isystem/usr/local/include conftest.C 1>&5
configure:10423:1: error: 'static_assert_line_10423' declared as an array with a negative size
CONFIGURE_STATIC_ASSERT(sizeof(wchar_t) == 2);
^~~~~~~~~~~~~~~~~~~~~~~~~~~~~~~~~~~~~~~~~~~~~
configure:10418:44: note: expanded from:
#define CONFIGURE_STATIC_ASSERT(condition) CONFIGURE_STATIC_ASSERT_IMPL(condition, __LINE__)
^
configure:10419:55: note: expanded from:
#define CONFIGURE_STATIC_ASSERT_IMPL(condition, line) CONFIGURE_STATIC_ASSERT_IMPL2(condition, line)
^
configure:10420:94: note: expanded from:
#define CONFIGURE_STATIC_ASSERT_IMPL2(condition, line) typedef int static_assert_line_##line[(condition) ? 1 : -1]
^~~~~~~~~~~~~~~~~~~~
configure:10424:22: error: 'static_assert_line_10424' declared as an array with a negative size
CONFIGURE_STATIC_ASSERT((wchar_t)-1 > (wchar_t) 0)
^~~~~~~~~~~~~~~~~~~~~~~~~~~~~~~~~~~~~~~~~~~~~~~~~~
configure:10418:44: note: expanded from:
#define CONFIGURE_STATIC_ASSERT(condition) CONFIGURE_STATIC_ASSERT_IMPL(condition, __LINE__)
^
configure:10419:55: note: expanded from:
#define CONFIGURE_STATIC_ASSERT_IMPL(condition, line) CONFIGURE_STATIC_ASSERT_IMPL2(condition, line)
^
configure:10420:94: note: expanded from:
#define CONFIGURE_STATIC_ASSERT_IMPL2(condition, line) typedef int static_assert_line_##line[(condition) ? 1 : -1]
^~~~~~~~~~~~~~~~~~~~
2 errors generated.
configure: failed program was:
#line 10415 "configure"
#include "confdefs.h"
#include <stddef.h>
#define CONFIGURE_STATIC_ASSERT(condition) CONFIGURE_STATIC_ASSERT_IMPL(condition, __LINE__)
#define CONFIGURE_STATIC_ASSERT_IMPL(condition, line) CONFIGURE_STATIC_ASSERT_IMPL2(condition, line)
#define CONFIGURE_STATIC_ASSERT_IMPL2(condition, line) typedef int static_assert_line_##line[(condition) ? 1 : -1]
int main() {
CONFIGURE_STATIC_ASSERT(sizeof(wchar_t) == 2);
CONFIGURE_STATIC_ASSERT((wchar_t)-1 > (wchar_t) 0)
; return 0; }
configure:10512: checking for visibility(hidden) attribute
configure:10540: checking for visibility(default) attribute
configure:10568: checking for visibility pragma support
configure:10593: checking For gcc visibility bug with class-level attributes (GCC bug 26905)
configure:10621: checking For x86_64 gcc visibility bug with builtins (GCC bug 20297)
configure:10676: checking for gcc PR49911
configure:10737: clang++ -o conftest -O2 -Qunused-arguments -O2 -pipe -march=pentium4 -mtune=pentium4 -Wno-error -w -isystem/usr/local/include -L/usr/local/lib -L/usr/local/lib -Wl,-z,origin -Wl,-rpath,\$$ORIGIN -Wl,-z,noexecstack conftest.C 1>&5
Stack dump:
0. Program arguments: /usr/bin/clang++ -cc1 -triple i386-unknown-freebsd9.0 -emit-obj -disable-free -main-file-name conftest.C -mrelocation-model static -mdisable-fp-elim -masm-verbose -mconstructor-aliases -target-cpu pentium4 -momit-leaf-frame-pointer -resource-dir /usr/bin/../lib/clang/3.0 -isystem /usr/local/include -fmodule-cache-path /tmp/clang-module-cache -O2 -Wno-error -w -fdeprecated-macro -ferror-limit 19 -fmessage-length 0 -fgnu-runtime -fobjc-runtime-has-arc -fobjc-runtime-has-weak -fobjc-fragile-abi -fcxx-exceptions -fexceptions -fdiagnostics-show-option -o /tmp/conftest-23fEqr.o -x c++ conftest.C
1. configure:10728:1: current parser token '__attribute__'
2. configure:10727:12: LLVM IR generation of declaration 'x'
3. configure:10727:12: Generating code for declaration 'x'
clang++: error: unable to execute command: Illegal instruction: 4 (core dumped)
clang++: error: clang frontend command failed due to signal 2 (use -v to see invocation)
clang++: note: diagnostic msg: Please submit a bug report to http://llvm.org/bugs/ and include command line arguments and all diagnostic information.
clang++: note: diagnostic msg: Preprocessed source(s) are located at:
clang++: note: diagnostic msg: /tmp/conftest-xw8tob.ii
configure: failed program was:
#line 10693 "configure"
#include "confdefs.h"
#ifdef __cplusplus
extern "C" void exit(int);
#endif
extern "C" void abort(void);
typedef enum {
eax, ecx, edx, ebx, esp, ebp,
esi, edi }
RegisterID;
union StateRemat {
RegisterID reg_;
int offset_;
};
static StateRemat FromRegister(RegisterID reg) {
StateRemat sr;
sr.reg_ = reg;
return sr;
}
static StateRemat FromAddress3(int address) {
StateRemat sr;
sr.offset_ = address;
if (address < 46 && address >= 0) {
abort();
}
return sr;
}
struct FrameState {
StateRemat dataRematInfo2(bool y, int z) {
if (y) return FromRegister(RegisterID(1));
return FromAddress3(z);
}
};
FrameState frame;
StateRemat x;
__attribute__((noinline)) void jsop_setelem(bool y, int z) {
x = frame.dataRematInfo2(y, z);
}
int main(void) {
jsop_setelem(0, 47);
}
configure:10770: checking for gcc pr39608
configure:10800: clang++ -c -O2 -pipe -march=pentium4 -mtune=pentium4 -fno-strict-aliasing -O2 -pipe -march=pentium4 -mtune=pentium4 -Wno-error -w -fno-exceptions -fno-strict-aliasing -fno-rtti -ffunction-sections -fdata-sections -fno-exceptions -std=gnu++0x -fno-tree-vrp -Qunused-arguments -O2 -pipe -march=pentium4 -mtune=pentium4 -Wno-error -w -isystem/usr/local/include conftest.C 1>&5
configure:10827: checking for llvm pr8927
configure:10867: clang -o conftest -O2 -Qunused-arguments -O2 -pipe -march=pentium4 -mtune=pentium4 -Wno-error -w -isystem/usr/local/include -L/usr/local/lib -L/usr/local/lib -Wl,-z,origin -Wl,-rpath,\$$ORIGIN -Wl,-z,noexecstack conftest.c 1>&5
configure:10904: checking for __force_align_arg_pointer__ attribute
configure:10916: clang -c -O2 -pipe -march=pentium4 -mtune=pentium4 -fno-strict-aliasing -fno-strict-aliasing -ffunction-sections -fdata-sections -fno-tree-vrp -Werror -Qunused-arguments -O2 -pipe -march=pentium4 -mtune=pentium4 -Wno-error -w -isystem/usr/local/include conftest.c 1>&5
configure:10943: checking for dirent.h that defines DIR
configure:10956: clang -c -O2 -pipe -march=pentium4 -mtune=pentium4 -fno-strict-aliasing -fno-strict-aliasing -ffunction-sections -fdata-sections -fno-tree-vrp -Qunused-arguments -O2 -pipe -march=pentium4 -mtune=pentium4 -Wno-error -w -isystem/usr/local/include conftest.c 1>&5
configure:10984: checking for opendir in -ldir
configure:11003: clang -o conftest -O2 -pipe -march=pentium4 -mtune=pentium4 -fno-strict-aliasing -fno-strict-aliasing -ffunction-sections -fdata-sections -fno-tree-vrp -Qunused-arguments -O2 -pipe -march=pentium4 -mtune=pentium4 -Wno-error -w -isystem/usr/local/include -L/usr/local/lib -L/usr/local/lib -Wl,-z,origin -Wl,-rpath,\$$ORIGIN -Wl,-z,noexecstack conftest.c -ldir 1>&5
/usr/bin/ld: cannot find -ldir
clang: error: linker command failed with exit code 1 (use -v to see invocation)
configure: failed program was:
#line 10992 "configure"
#include "confdefs.h"
/* Override any gcc2 internal prototype to avoid an error. */
/* We use char because int might match the return type of a gcc2
builtin and then its argument prototype would still apply. */
char opendir();
int main() {
opendir()
; return 0; }
configure:11078: checking for sys/byteorder.h
configure:11091: clang -c -O2 -pipe -march=pentium4 -mtune=pentium4 -fno-strict-aliasing -fno-strict-aliasing -ffunction-sections -fdata-sections -fno-tree-vrp -Qunused-arguments -O2 -pipe -march=pentium4 -mtune=pentium4 -Wno-error -w -isystem/usr/local/include -I/usr/local/include conftest.c 1>&5
configure:11085:10: fatal error: 'sys/byteorder.h' file not found
#include <sys/byteorder.h>
^
1 error generated.
configure: failed program was:
#line 11083 "configure"
#include "confdefs.h"
#include <sys/byteorder.h>
int main() {
; return 0; }
configure:11078: checking for compat.h
configure:11091: clang -c -O2 -pipe -march=pentium4 -mtune=pentium4 -fno-strict-aliasing -fno-strict-aliasing -ffunction-sections -fdata-sections -fno-tree-vrp -Qunused-arguments -O2 -pipe -march=pentium4 -mtune=pentium4 -Wno-error -w -isystem/usr/local/include -I/usr/local/include conftest.c 1>&5
configure:11085:10: fatal error: 'compat.h' file not found
#include <compat.h>
^
1 error generated.
configure: failed program was:
#line 11083 "configure"
#include "confdefs.h"
#include <compat.h>
int main() {
; return 0; }
configure:11078: checking for getopt.h
configure:11091: clang -c -O2 -pipe -march=pentium4 -mtune=pentium4 -fno-strict-aliasing -fno-strict-aliasing -ffunction-sections -fdata-sections -fno-tree-vrp -Qunused-arguments -O2 -pipe -march=pentium4 -mtune=pentium4 -Wno-error -w -isystem/usr/local/include -I/usr/local/include conftest.c 1>&5
configure:11078: checking for sys/bitypes.h
configure:11091: clang -c -O2 -pipe -march=pentium4 -mtune=pentium4 -fno-strict-aliasing -fno-strict-aliasing -ffunction-sections -fdata-sections -fno-tree-vrp -Qunused-arguments -O2 -pipe -march=pentium4 -mtune=pentium4 -Wno-error -w -isystem/usr/local/include -I/usr/local/include conftest.c 1>&5
configure:11085:10: fatal error: 'sys/bitypes.h' file not found
#include <sys/bitypes.h>
^
1 error generated.
configure: failed program was:
#line 11083 "configure"
#include "confdefs.h"
#include <sys/bitypes.h>
int main() {
; return 0; }
configure:11078: checking for memory.h
configure:11091: clang -c -O2 -pipe -march=pentium4 -mtune=pentium4 -fno-strict-aliasing -fno-strict-aliasing -ffunction-sections -fdata-sections -fno-tree-vrp -Qunused-arguments -O2 -pipe -march=pentium4 -mtune=pentium4 -Wno-error -w -isystem/usr/local/include -I/usr/local/include conftest.c 1>&5
configure:11078: checking for unistd.h
configure:11091: clang -c -O2 -pipe -march=pentium4 -mtune=pentium4 -fno-strict-aliasing -fno-strict-aliasing -ffunction-sections -fdata-sections -fno-tree-vrp -Qunused-arguments -O2 -pipe -march=pentium4 -mtune=pentium4 -Wno-error -w -isystem/usr/local/include -I/usr/local/include conftest.c 1>&5
configure:11078: checking for gnu/libc-version.h
configure:11091: clang -c -O2 -pipe -march=pentium4 -mtune=pentium4 -fno-strict-aliasing -fno-strict-aliasing -ffunction-sections -fdata-sections -fno-tree-vrp -Qunused-arguments -O2 -pipe -march=pentium4 -mtune=pentium4 -Wno-error -w -isystem/usr/local/include -I/usr/local/include conftest.c 1>&5
configure:11085:10: fatal error: 'gnu/libc-version.h' file not found
#include <gnu/libc-version.h>
^
1 error generated.
configure: failed program was:
#line 11083 "configure"
#include "confdefs.h"
#include <gnu/libc-version.h>
int main() {
; return 0; }
configure:11078: checking for nl_types.h
configure:11091: clang -c -O2 -pipe -march=pentium4 -mtune=pentium4 -fno-strict-aliasing -fno-strict-aliasing -ffunction-sections -fdata-sections -fno-tree-vrp -Qunused-arguments -O2 -pipe -march=pentium4 -mtune=pentium4 -Wno-error -w -isystem/usr/local/include -I/usr/local/include conftest.c 1>&5
configure:11078: checking for malloc.h
configure:11091: clang -c -O2 -pipe -march=pentium4 -mtune=pentium4 -fno-strict-aliasing -fno-strict-aliasing -ffunction-sections -fdata-sections -fno-tree-vrp -Qunused-arguments -O2 -pipe -march=pentium4 -mtune=pentium4 -Wno-error -w -isystem/usr/local/include -I/usr/local/include conftest.c 1>&5
In file included from configure:11085:
/usr/include/malloc.h:3:2: error: #error "<malloc.h> has been replaced by <stdlib.h>"
#error "<malloc.h> has been replaced by <stdlib.h>"
^
1 error generated.
configure: failed program was:
#line 11083 "configure"
#include "confdefs.h"
#include <malloc.h>
int main() {
; return 0; }
configure:11078: checking for X11/XKBlib.h
configure:11091: clang -c -O2 -pipe -march=pentium4 -mtune=pentium4 -fno-strict-aliasing -fno-strict-aliasing -ffunction-sections -fdata-sections -fno-tree-vrp -Qunused-arguments -O2 -pipe -march=pentium4 -mtune=pentium4 -Wno-error -w -isystem/usr/local/include -I/usr/local/include conftest.c 1>&5
configure:11078: checking for io.h
configure:11091: clang -c -O2 -pipe -march=pentium4 -mtune=pentium4 -fno-strict-aliasing -fno-strict-aliasing -ffunction-sections -fdata-sections -fno-tree-vrp -Qunused-arguments -O2 -pipe -march=pentium4 -mtune=pentium4 -Wno-error -w -isystem/usr/local/include -I/usr/local/include conftest.c 1>&5
configure:11085:10: fatal error: 'io.h' file not found
#include <io.h>
^
1 error generated.
configure: failed program was:
#line 11083 "configure"
#include "confdefs.h"
#include <io.h>
int main() {
; return 0; }
configure:11078: checking for cpuid.h
configure:11091: clang -c -O2 -pipe -march=pentium4 -mtune=pentium4 -fno-strict-aliasing -fno-strict-aliasing -ffunction-sections -fdata-sections -fno-tree-vrp -Qunused-arguments -O2 -pipe -march=pentium4 -mtune=pentium4 -Wno-error -w -isystem/usr/local/include -I/usr/local/include conftest.c 1>&5
configure:11085:10: fatal error: 'cpuid.h' file not found
#include <cpuid.h>
^
1 error generated.
configure: failed program was:
#line 11083 "configure"
#include "confdefs.h"
#include <cpuid.h>
int main() {
; return 0; }
configure:11126: checking for sys/statvfs.h
configure:11139: clang -c -O2 -pipe -march=pentium4 -mtune=pentium4 -fno-strict-aliasing -fno-strict-aliasing -ffunction-sections -fdata-sections -fno-tree-vrp -Qunused-arguments -O2 -pipe -march=pentium4 -mtune=pentium4 -Wno-error -w -isystem/usr/local/include -I/usr/local/include conftest.c 1>&5
configure:11126: checking for sys/statfs.h
configure:11139: clang -c -O2 -pipe -march=pentium4 -mtune=pentium4 -fno-strict-aliasing -fno-strict-aliasing -ffunction-sections -fdata-sections -fno-tree-vrp -Qunused-arguments -O2 -pipe -march=pentium4 -mtune=pentium4 -Wno-error -w -isystem/usr/local/include -I/usr/local/include conftest.c 1>&5
configure:11133:10: fatal error: 'sys/statfs.h' file not found
#include <sys/statfs.h>
^
1 error generated.
configure: failed program was:
#line 11131 "configure"
#include "confdefs.h"
#include <sys/statfs.h>
int main() {
; return 0; }
configure:11126: checking for sys/vfs.h
configure:11139: clang -c -O2 -pipe -march=pentium4 -mtune=pentium4 -fno-strict-aliasing -fno-strict-aliasing -ffunction-sections -fdata-sections -fno-tree-vrp -Qunused-arguments -O2 -pipe -march=pentium4 -mtune=pentium4 -Wno-error -w -isystem/usr/local/include -I/usr/local/include conftest.c 1>&5
configure:11133:10: fatal error: 'sys/vfs.h' file not found
#include <sys/vfs.h>
^
1 error generated.
configure: failed program was:
#line 11131 "configure"
#include "confdefs.h"
#include <sys/vfs.h>
int main() {
; return 0; }
configure:11126: checking for sys/mount.h
configure:11139: clang -c -O2 -pipe -march=pentium4 -mtune=pentium4 -fno-strict-aliasing -fno-strict-aliasing -ffunction-sections -fdata-sections -fno-tree-vrp -Qunused-arguments -O2 -pipe -march=pentium4 -mtune=pentium4 -Wno-error -w -isystem/usr/local/include -I/usr/local/include conftest.c 1>&5
configure:11173: checking for sys/quota.h
configure:11186: clang -c -O2 -pipe -march=pentium4 -mtune=pentium4 -fno-strict-aliasing -fno-strict-aliasing -ffunction-sections -fdata-sections -fno-tree-vrp -Qunused-arguments -O2 -pipe -march=pentium4 -mtune=pentium4 -Wno-error -w -isystem/usr/local/include -I/usr/local/include conftest.c 1>&5
configure:11180:10: fatal error: 'sys/quota.h' file not found
#include <sys/quota.h>
^
1 error generated.
configure: failed program was:
#line 11178 "configure"
#include "confdefs.h"
#include <sys/quota.h>
int main() {
; return 0; }
configure:11173: checking for sys/sysmacros.h
configure:11186: clang -c -O2 -pipe -march=pentium4 -mtune=pentium4 -fno-strict-aliasing -fno-strict-aliasing -ffunction-sections -fdata-sections -fno-tree-vrp -Qunused-arguments -O2 -pipe -march=pentium4 -mtune=pentium4 -Wno-error -w -isystem/usr/local/include -I/usr/local/include conftest.c 1>&5
configure:11180:10: fatal error: 'sys/sysmacros.h' file not found
#include <sys/sysmacros.h>
^
1 error generated.
configure: failed program was:
#line 11178 "configure"
#include "confdefs.h"
#include <sys/sysmacros.h>
int main() {
; return 0; }
configure:11219: checking for linux/quota.h
configure:11232: clang -c -O2 -pipe -march=pentium4 -mtune=pentium4 -fno-strict-aliasing -fno-strict-aliasing -ffunction-sections -fdata-sections -fno-tree-vrp -Qunused-arguments -O2 -pipe -march=pentium4 -mtune=pentium4 -Wno-error -w -isystem/usr/local/include -I/usr/local/include conftest.c 1>&5
configure:11226:10: fatal error: 'linux/quota.h' file not found
#include <linux/quota.h>
^
1 error generated.
configure: failed program was:
#line 11224 "configure"
#include "confdefs.h"
#include <sys/socket.h>
#include <linux/quota.h>
int main() {
; return 0; }
configure:11266: checking for linux/if_addr.h
configure:11279: clang -c -O2 -pipe -march=pentium4 -mtune=pentium4 -fno-strict-aliasing -fno-strict-aliasing -ffunction-sections -fdata-sections -fno-tree-vrp -Qunused-arguments -O2 -pipe -march=pentium4 -mtune=pentium4 -Wno-error -w -isystem/usr/local/include -I/usr/local/include conftest.c 1>&5
configure:11273:10: fatal error: 'linux/if_addr.h' file not found
#include <linux/if_addr.h>
^
1 error generated.
configure: failed program was:
#line 11271 "configure"
#include "confdefs.h"
#include <sys/socket.h>
#include <linux/if_addr.h>
int main() {
; return 0; }
configure:11266: checking for linux/rtnetlink.h
configure:11279: clang -c -O2 -pipe -march=pentium4 -mtune=pentium4 -fno-strict-aliasing -fno-strict-aliasing -ffunction-sections -fdata-sections -fno-tree-vrp -Qunused-arguments -O2 -pipe -march=pentium4 -mtune=pentium4 -Wno-error -w -isystem/usr/local/include -I/usr/local/include conftest.c 1>&5
configure:11273:10: fatal error: 'linux/rtnetlink.h' file not found
#include <linux/rtnetlink.h>
^
1 error generated.
configure: failed program was:
#line 11271 "configure"
#include "confdefs.h"
#include <sys/socket.h>
#include <linux/rtnetlink.h>
int main() {
; return 0; }
configure:11313: checking for sys/types.h
configure:11326: clang -c -O2 -pipe -march=pentium4 -mtune=pentium4 -fno-strict-aliasing -fno-strict-aliasing -ffunction-sections -fdata-sections -fno-tree-vrp -Qunused-arguments -O2 -pipe -march=pentium4 -mtune=pentium4 -Wno-error -w -isystem/usr/local/include -I/usr/local/include conftest.c 1>&5
configure:11313: checking for netinet/in.h
configure:11326: clang -c -O2 -pipe -march=pentium4 -mtune=pentium4 -fno-strict-aliasing -fno-strict-aliasing -ffunction-sections -fdata-sections -fno-tree-vrp -Qunused-arguments -O2 -pipe -march=pentium4 -mtune=pentium4 -Wno-error -w -isystem/usr/local/include -I/usr/local/include conftest.c 1>&5
configure:11313: checking for byteswap.h
configure:11326: clang -c -O2 -pipe -march=pentium4 -mtune=pentium4 -fno-strict-aliasing -fno-strict-aliasing -ffunction-sections -fdata-sections -fno-tree-vrp -Qunused-arguments -O2 -pipe -march=pentium4 -mtune=pentium4 -Wno-error -w -isystem/usr/local/include -I/usr/local/include conftest.c 1>&5
configure:11320:10: fatal error: 'byteswap.h' file not found
#include <byteswap.h>
^
1 error generated.
configure: failed program was:
#line 11318 "configure"
#include "confdefs.h"
#include <byteswap.h>
int main() {
; return 0; }
configure:11357: checking for sockaddr_in.sin_len
configure:11374: clang -c -O2 -pipe -march=pentium4 -mtune=pentium4 -fno-strict-aliasing -fno-strict-aliasing -ffunction-sections -fdata-sections -fno-tree-vrp -Qunused-arguments -O2 -pipe -march=pentium4 -mtune=pentium4 -Wno-error -w -isystem/usr/local/include -I/usr/local/include conftest.c 1>&5
configure:11405: checking for sockaddr_in6.sin6_len
configure:11422: clang -c -O2 -pipe -march=pentium4 -mtune=pentium4 -fno-strict-aliasing -fno-strict-aliasing -ffunction-sections -fdata-sections -fno-tree-vrp -Qunused-arguments -O2 -pipe -march=pentium4 -mtune=pentium4 -Wno-error -w -isystem/usr/local/include -I/usr/local/include conftest.c 1>&5
Stack dump:
0. Program arguments: /usr/bin/clang -cc1 -triple i386-unknown-freebsd9.0 -emit-obj -disable-free -main-file-name conftest.c -mrelocation-model static -mdisable-fp-elim -relaxed-aliasing -masm-verbose -mconstructor-aliases -target-cpu pentium4 -momit-leaf-frame-pointer -ffunction-sections -fdata-sections -coverage-file conftest.o -resource-dir /usr/bin/../lib/clang/3.0 -isystem /usr/local/include -I /usr/local/include -fmodule-cache-path /tmp/clang-module-cache -O2 -Wno-error -w -ferror-limit 19 -fmessage-length 0 -fgnu-runtime -fobjc-runtime-has-arc -fobjc-runtime-has-weak -fobjc-fragile-abi -fdiagnostics-show-option -o conftest.o -x c conftest.c
1. configure:11417:1: current parser token 'int'
2. configure:11416:39: LLVM IR generation of declaration 'foo'
3. configure:11416:39: Generating code for declaration 'foo'
clang: error: unable to execute command: Illegal instruction: 4 (core dumped)
clang: error: clang frontend command failed due to signal 2 (use -v to see invocation)
clang: note: diagnostic msg: Please submit a bug report to http://llvm.org/bugs/ and include command line arguments and all diagnostic information.
clang: note: diagnostic msg: Preprocessed source(s) are located at:
clang: note: diagnostic msg: /tmp/conftest-k6gUPt.i
configure: failed program was:
#line 11410 "configure"
#include "confdefs.h"
#ifdef HAVE_SYS_TYPES_H
#include <sys/types.h>
#endif
#include <netinet/in.h>
struct sockaddr_in6 x;
void *foo = (void*) &x.sin6_len;
int main() {
; return 0; }
configure:11446: checking for sockaddr.sa_len
configure:11463: clang -c -O2 -pipe -march=pentium4 -mtune=pentium4 -fno-strict-aliasing -fno-strict-aliasing -ffunction-sections -fdata-sections -fno-tree-vrp -Qunused-arguments -O2 -pipe -march=pentium4 -mtune=pentium4 -Wno-error -w -isystem/usr/local/include -I/usr/local/include conftest.c 1>&5
configure:11496: checking for new
configure:11509: clang++ -c -O2 -pipe -march=pentium4 -mtune=pentium4 -fno-strict-aliasing -O2 -pipe -march=pentium4 -mtune=pentium4 -Wno-error -w -fno-exceptions -fno-strict-aliasing -fno-rtti -ffunction-sections -fdata-sections -fno-exceptions -std=gnu++0x -fno-tree-vrp -Qunused-arguments -O2 -pipe -march=pentium4 -mtune=pentium4 -Wno-error -w -isystem/usr/local/include -I/usr/local/include conftest.C 1>&5
configure:11608: checking for sys/cdefs.h
configure:11621: clang -c -O2 -pipe -march=pentium4 -mtune=pentium4 -fno-strict-aliasing -fno-strict-aliasing -ffunction-sections -fdata-sections -fno-tree-vrp -Qunused-arguments -O2 -pipe -march=pentium4 -mtune=pentium4 -Wno-error -w -isystem/usr/local/include -I/usr/local/include conftest.c 1>&5
configure:11673: checking for linux/perf_event.h
configure:11686: clang -c -O2 -pipe -march=pentium4 -mtune=pentium4 -fno-strict-aliasing -fno-strict-aliasing -ffunction-sections -fdata-sections -fno-tree-vrp -Qunused-arguments -O2 -pipe -march=pentium4 -mtune=pentium4 -Wno-error -w -isystem/usr/local/include -I/usr/local/include conftest.c 1>&5
configure:11680:10: fatal error: 'linux/perf_event.h' file not found
#include <linux/perf_event.h>
^
1 error generated.
configure: failed program was:
#line 11678 "configure"
#include "confdefs.h"
#include <linux/perf_event.h>
int main() {
; return 0; }
configure:11749: checking for gethostbyname_r in -lc_r
configure:11768: clang -o conftest -O2 -pipe -march=pentium4 -mtune=pentium4 -fno-strict-aliasing -fno-strict-aliasing -ffunction-sections -fdata-sections -fno-tree-vrp -Qunused-arguments -O2 -pipe -march=pentium4 -mtune=pentium4 -Wno-error -w -isystem/usr/local/include -I/usr/local/include -L/usr/local/lib -L/usr/local/lib -Wl,-z,origin -Wl,-rpath,\$$ORIGIN -Wl,-z,noexecstack conftest.c -lc_r 1>&5
/usr/bin/ld: cannot find -lc_r
clang: error: linker command failed with exit code 1 (use -v to see invocation)
configure: failed program was:
#line 11757 "configure"
#include "confdefs.h"
/* Override any gcc2 internal prototype to avoid an error. */
/* We use char because int might match the return type of a gcc2
builtin and then its argument prototype would still apply. */
char gethostbyname_r();
int main() {
gethostbyname_r()
; return 0; }
configure:11809: checking for library containing dlopen
configure:11827: clang -o conftest -O2 -pipe -march=pentium4 -mtune=pentium4 -fno-strict-aliasing -fno-strict-aliasing -ffunction-sections -fdata-sections -fno-tree-vrp -Qunused-arguments -O2 -pipe -march=pentium4 -mtune=pentium4 -Wno-error -w -isystem/usr/local/include -I/usr/local/include -L/usr/local/lib -L/usr/local/lib -Wl,-z,origin -Wl,-rpath,\$$ORIGIN -Wl,-z,noexecstack conftest.c 1>&5
configure:11867: checking for dlfcn.h
configure:11880: clang -c -O2 -pipe -march=pentium4 -mtune=pentium4 -fno-strict-aliasing -fno-strict-aliasing -ffunction-sections -fdata-sections -fno-tree-vrp -Qunused-arguments -O2 -pipe -march=pentium4 -mtune=pentium4 -Wno-error -w -isystem/usr/local/include -I/usr/local/include conftest.c 1>&5
configure:11917: checking for dladdr
configure:11945: clang -o conftest -O2 -pipe -march=pentium4 -mtune=pentium4 -fno-strict-aliasing -fno-strict-aliasing -ffunction-sections -fdata-sections -fno-tree-vrp -D_GNU_SOURCE -Qunused-arguments -O2 -pipe -march=pentium4 -mtune=pentium4 -Wno-error -w -isystem/usr/local/include -I/usr/local/include -L/usr/local/lib -L/usr/local/lib -Wl,-z,origin -Wl,-rpath,\$$ORIGIN -Wl,-z,noexecstack conftest.c 1>&5
configure:11917: checking for memmem
configure:11945: clang -o conftest -O2 -pipe -march=pentium4 -mtune=pentium4 -fno-strict-aliasing -fno-strict-aliasing -ffunction-sections -fdata-sections -fno-tree-vrp -D_GNU_SOURCE -Qunused-arguments -O2 -pipe -march=pentium4 -mtune=pentium4 -Wno-error -w -isystem/usr/local/include -I/usr/local/include -L/usr/local/lib -L/usr/local/lib -Wl,-z,origin -Wl,-rpath,\$$ORIGIN -Wl,-z,noexecstack conftest.c 1>&5
configure:12089: checking for socket in -lsocket
configure:12108: clang -o conftest -O2 -pipe -march=pentium4 -mtune=pentium4 -fno-strict-aliasing -fno-strict-aliasing -ffunction-sections -fdata-sections -fno-tree-vrp -Qunused-arguments -O2 -pipe -march=pentium4 -mtune=pentium4 -Wno-error -w -isystem/usr/local/include -I/usr/local/include -L/usr/local/lib -L/usr/local/lib -Wl,-z,origin -Wl,-rpath,\$$ORIGIN -Wl,-z,noexecstack conftest.c -lsocket 1>&5
/usr/bin/ld: cannot find -lsocket
clang: error: linker command failed with exit code 1 (use -v to see invocation)
configure: failed program was:
#line 12097 "configure"
#include "confdefs.h"
/* Override any gcc2 internal prototype to avoid an error. */
/* We use char because int might match the return type of a gcc2
builtin and then its argument prototype would still apply. */
char socket();
int main() {
socket()
; return 0; }
configure:12163: checking for XDrawLines in -lX11
configure:12182: clang -o conftest -O2 -pipe -march=pentium4 -mtune=pentium4 -fno-strict-aliasing -fno-strict-aliasing -ffunction-sections -fdata-sections -fno-tree-vrp -Qunused-arguments -O2 -pipe -march=pentium4 -mtune=pentium4 -Wno-error -w -isystem/usr/local/include -I/usr/local/include -L/usr/local/lib -L/usr/local/lib -L/usr/local/lib -Wl,-z,origin -Wl,-rpath,\$$ORIGIN -Wl,-z,noexecstack conftest.c -lX11 -lX11 1>&5
configure:12204: checking for XextAddDisplay in -lXext
configure:12223: clang -o conftest -O2 -pipe -march=pentium4 -mtune=pentium4 -fno-strict-aliasing -fno-strict-aliasing -ffunction-sections -fdata-sections -fno-tree-vrp -Qunused-arguments -O2 -pipe -march=pentium4 -mtune=pentium4 -Wno-error -w -isystem/usr/local/include -I/usr/local/include -L/usr/local/lib -L/usr/local/lib -L/usr/local/lib -Wl,-z,origin -Wl,-rpath,\$$ORIGIN -Wl,-z,noexecstack conftest.c -lXext -lX11 1>&5
configure:12246: checking for XtFree in -lXt
configure:12265: clang -o conftest -O2 -pipe -march=pentium4 -mtune=pentium4 -fno-strict-aliasing -fno-strict-aliasing -ffunction-sections -fdata-sections -fno-tree-vrp -Qunused-arguments -O2 -pipe -march=pentium4 -mtune=pentium4 -Wno-error -w -isystem/usr/local/include -I/usr/local/include -L/usr/local/lib -L/usr/local/lib -L/usr/local/lib -Wl,-z,origin -Wl,-rpath,\$$ORIGIN -Wl,-z,noexecstack conftest.c -lXt 1>&5
configure:12419: checking for XShmCreateImage in -lXext
configure:12438: clang -o conftest -O2 -pipe -march=pentium4 -mtune=pentium4 -fno-strict-aliasing -fno-strict-aliasing -ffunction-sections -fdata-sections -fno-tree-vrp -Qunused-arguments -O2 -pipe -march=pentium4 -mtune=pentium4 -Wno-error -w -isystem/usr/local/include -I/usr/local/include -L/usr/local/lib -L/usr/local/lib -L/usr/local/lib -Wl,-z,origin -Wl,-rpath,\$$ORIGIN -Wl,-z,noexecstack conftest.c -lXext -lX11 -lXext 1>&5
configure:12461: checking for X11/extensions/scrnsaver.h
configure:12474: clang -c -O2 -pipe -march=pentium4 -mtune=pentium4 -fno-strict-aliasing -fno-strict-aliasing -ffunction-sections -fdata-sections -fno-tree-vrp -Qunused-arguments -O2 -pipe -march=pentium4 -mtune=pentium4 -Wno-error -w -isystem/usr/local/include -I/usr/local/include conftest.c 1>&5
configure:12489: checking for XScreenSaverQueryInfo in -lXss
configure:12508: clang -o conftest -O2 -pipe -march=pentium4 -mtune=pentium4 -fno-strict-aliasing -fno-strict-aliasing -ffunction-sections -fdata-sections -fno-tree-vrp -Qunused-arguments -O2 -pipe -march=pentium4 -mtune=pentium4 -Wno-error -w -isystem/usr/local/include -I/usr/local/include -L/usr/local/lib -L/usr/local/lib -L/usr/local/lib -Wl,-z,origin -Wl,-rpath,\$$ORIGIN -Wl,-z,noexecstack conftest.c -lXss -lXext -lX11 1>&5
configure:12558: checking for pthread_create in -lpthreads
clang -o dummy dummy.c -O2 -pipe -march=pentium4 -mtune=pentium4 -fno-strict-aliasing -fno-strict-aliasing -ffunction-sections -fdata-sections -fno-tree-vrp -Qunused-arguments -O2 -pipe -march=pentium4 -mtune=pentium4 -Wno-error -w -isystem/usr/local/include -I/usr/local/include -lpthreads -L/usr/local/lib -L/usr/local/lib -Wl,-z,origin -Wl,-rpath,\$$ORIGIN -Wl,-z,noexecstack
/usr/bin/ld: cannot find -lpthreads
clang: error: linker command failed with exit code 1 (use -v to see invocation)
configure:12581: checking for pthread_create in -lpthread
clang -o dummy dummy.c -O2 -pipe -march=pentium4 -mtune=pentium4 -fno-strict-aliasing -fno-strict-aliasing -ffunction-sections -fdata-sections -fno-tree-vrp -Qunused-arguments -O2 -pipe -march=pentium4 -mtune=pentium4 -Wno-error -w -isystem/usr/local/include -I/usr/local/include -lpthread -L/usr/local/lib -L/usr/local/lib -Wl,-z,origin -Wl,-rpath,\$$ORIGIN -Wl,-z,noexecstack
configure:12686: checking whether clang accepts -pthread
configure:12814: checking whether clang needs -traditional
configure:12821:10: fatal error: 'sgtty.h' file not found
#include <sgtty.h>
^
1 error generated.
configure:12839:10: fatal error: 'termio.h' file not found
#include <termio.h>
^
1 error generated.
configure:12860: checking for 8-bit clean memcmp
configure:12878: clang -o conftest -O2 -pipe -march=pentium4 -mtune=pentium4 -fno-strict-aliasing -fno-strict-aliasing -ffunction-sections -fdata-sections -fno-tree-vrp -Qunused-arguments -O2 -pipe -march=pentium4 -mtune=pentium4 -Wno-error -w -isystem/usr/local/include -I/usr/local/include -pthread -L/usr/local/lib -L/usr/local/lib -Wl,-z,origin -Wl,-rpath,\$$ORIGIN -Wl,-z,noexecstack conftest.c 1>&5
configure:12898: checking for random
configure:12926: clang -o conftest -O2 -pipe -march=pentium4 -mtune=pentium4 -fno-strict-aliasing -fno-strict-aliasing -ffunction-sections -fdata-sections -fno-tree-vrp -Qunused-arguments -O2 -pipe -march=pentium4 -mtune=pentium4 -Wno-error -w -isystem/usr/local/include -I/usr/local/include -pthread -L/usr/local/lib -L/usr/local/lib -Wl,-z,origin -Wl,-rpath,\$$ORIGIN -Wl,-z,noexecstack conftest.c 1>&5
configure:12898: checking for strerror
configure:12926: clang -o conftest -O2 -pipe -march=pentium4 -mtune=pentium4 -fno-strict-aliasing -fno-strict-aliasing -ffunction-sections -fdata-sections -fno-tree-vrp -Qunused-arguments -O2 -pipe -march=pentium4 -mtune=pentium4 -Wno-error -w -isystem/usr/local/include -I/usr/local/include -pthread -L/usr/local/lib -L/usr/local/lib -Wl,-z,origin -Wl,-rpath,\$$ORIGIN -Wl,-z,noexecstack conftest.c 1>&5
configure:12898: checking for lchown
configure:12926: clang -o conftest -O2 -pipe -march=pentium4 -mtune=pentium4 -fno-strict-aliasing -fno-strict-aliasing -ffunction-sections -fdata-sections -fno-tree-vrp -Qunused-arguments -O2 -pipe -march=pentium4 -mtune=pentium4 -Wno-error -w -isystem/usr/local/include -I/usr/local/include -pthread -L/usr/local/lib -L/usr/local/lib -Wl,-z,origin -Wl,-rpath,\$$ORIGIN -Wl,-z,noexecstack conftest.c 1>&5
configure:12898: checking for fchmod
configure:12926: clang -o conftest -O2 -pipe -march=pentium4 -mtune=pentium4 -fno-strict-aliasing -fno-strict-aliasing -ffunction-sections -fdata-sections -fno-tree-vrp -Qunused-arguments -O2 -pipe -march=pentium4 -mtune=pentium4 -Wno-error -w -isystem/usr/local/include -I/usr/local/include -pthread -L/usr/local/lib -L/usr/local/lib -Wl,-z,origin -Wl,-rpath,\$$ORIGIN -Wl,-z,noexecstack conftest.c 1>&5
configure:12898: checking for snprintf
configure:12926: clang -o conftest -O2 -pipe -march=pentium4 -mtune=pentium4 -fno-strict-aliasing -fno-strict-aliasing -ffunction-sections -fdata-sections -fno-tree-vrp -Qunused-arguments -O2 -pipe -march=pentium4 -mtune=pentium4 -Wno-error -w -isystem/usr/local/include -I/usr/local/include -pthread -L/usr/local/lib -L/usr/local/lib -Wl,-z,origin -Wl,-rpath,\$$ORIGIN -Wl,-z,noexecstack conftest.c 1>&5
configure:12898: checking for memmove
configure:12926: clang -o conftest -O2 -pipe -march=pentium4 -mtune=pentium4 -fno-strict-aliasing -fno-strict-aliasing -ffunction-sections -fdata-sections -fno-tree-vrp -Qunused-arguments -O2 -pipe -march=pentium4 -mtune=pentium4 -Wno-error -w -isystem/usr/local/include -I/usr/local/include -pthread -L/usr/local/lib -L/usr/local/lib -Wl,-z,origin -Wl,-rpath,\$$ORIGIN -Wl,-z,noexecstack conftest.c 1>&5
configure:12898: checking for rint
configure:12926: clang -o conftest -O2 -pipe -march=pentium4 -mtune=pentium4 -fno-strict-aliasing -fno-strict-aliasing -ffunction-sections -fdata-sections -fno-tree-vrp -Qunused-arguments -O2 -pipe -march=pentium4 -mtune=pentium4 -Wno-error -w -isystem/usr/local/include -I/usr/local/include -pthread -L/usr/local/lib -L/usr/local/lib -Wl,-z,origin -Wl,-rpath,\$$ORIGIN -Wl,-z,noexecstack conftest.c 1>&5
/tmp/conftest-ymd17J.o: In function `main':
conftest.c:(.text.main+0x7): undefined reference to `rint'
clang: error: linker command failed with exit code 1 (use -v to see invocation)
configure: failed program was:
#line 12903 "configure"
#include "confdefs.h"
/* System header to define __stub macros and hopefully few prototypes,
which can conflict with char rint(); below. */
#include <assert.h>
/* Override any gcc2 internal prototype to avoid an error. */
/* We use char because int might match the return type of a gcc2
builtin and then its argument prototype would still apply. */
char rint();
int main() {
/* The GNU C library defines this for functions which it implements
to always fail with ENOSYS. Some functions are actually named
something starting with __ and the normal name is an alias. */
#if defined (__stub_rint) || defined (__stub___rint)
choke me
#else
rint();
#endif
; return 0; }
configure:12898: checking for stat64
configure:12926: clang -o conftest -O2 -pipe -march=pentium4 -mtune=pentium4 -fno-strict-aliasing -fno-strict-aliasing -ffunction-sections -fdata-sections -fno-tree-vrp -Qunused-arguments -O2 -pipe -march=pentium4 -mtune=pentium4 -Wno-error -w -isystem/usr/local/include -I/usr/local/include -pthread -L/usr/local/lib -L/usr/local/lib -Wl,-z,origin -Wl,-rpath,\$$ORIGIN -Wl,-z,noexecstack conftest.c 1>&5
/tmp/conftest-nvPVrF.o: In function `main':
conftest.c:(.text.main+0x7): undefined reference to `stat64'
clang: error: linker command failed with exit code 1 (use -v to see invocation)
configure: failed program was:
#line 12903 "configure"
#include "confdefs.h"
/* System header to define __stub macros and hopefully few prototypes,
which can conflict with char stat64(); below. */
#include <assert.h>
/* Override any gcc2 internal prototype to avoid an error. */
/* We use char because int might match the return type of a gcc2
builtin and then its argument prototype would still apply. */
char stat64();
int main() {
/* The GNU C library defines this for functions which it implements
to always fail with ENOSYS. Some functions are actually named
something starting with __ and the normal name is an alias. */
#if defined (__stub_stat64) || defined (__stub___stat64)
choke me
#else
stat64();
#endif
; return 0; }
configure:12898: checking for lstat64
configure:12926: clang -o conftest -O2 -pipe -march=pentium4 -mtune=pentium4 -fno-strict-aliasing -fno-strict-aliasing -ffunction-sections -fdata-sections -fno-tree-vrp -Qunused-arguments -O2 -pipe -march=pentium4 -mtune=pentium4 -Wno-error -w -isystem/usr/local/include -I/usr/local/include -pthread -L/usr/local/lib -L/usr/local/lib -Wl,-z,origin -Wl,-rpath,\$$ORIGIN -Wl,-z,noexecstack conftest.c 1>&5
/tmp/conftest-VDsKaI.o: In function `main':
conftest.c:(.text.main+0x7): undefined reference to `lstat64'
clang: error: linker command failed with exit code 1 (use -v to see invocation)
configure: failed program was:
#line 12903 "configure"
#include "confdefs.h"
/* System header to define __stub macros and hopefully few prototypes,
which can conflict with char lstat64(); below. */
#include <assert.h>
/* Override any gcc2 internal prototype to avoid an error. */
/* We use char because int might match the return type of a gcc2
builtin and then its argument prototype would still apply. */
char lstat64();
int main() {
/* The GNU C library defines this for functions which it implements
to always fail with ENOSYS. Some functions are actually named
something starting with __ and the normal name is an alias. */
#if defined (__stub_lstat64) || defined (__stub___lstat64)
choke me
#else
lstat64();
#endif
; return 0; }
configure:12898: checking for truncate64
configure:12926: clang -o conftest -O2 -pipe -march=pentium4 -mtune=pentium4 -fno-strict-aliasing -fno-strict-aliasing -ffunction-sections -fdata-sections -fno-tree-vrp -Qunused-arguments -O2 -pipe -march=pentium4 -mtune=pentium4 -Wno-error -w -isystem/usr/local/include -I/usr/local/include -pthread -L/usr/local/lib -L/usr/local/lib -Wl,-z,origin -Wl,-rpath,\$$ORIGIN -Wl,-z,noexecstack conftest.c 1>&5
/tmp/conftest-7x3xg6.o: In function `main':
conftest.c:(.text.main+0x7): undefined reference to `truncate64'
clang: error: linker command failed with exit code 1 (use -v to see invocation)
configure: failed program was:
#line 12903 "configure"
#include "confdefs.h"
/* System header to define __stub macros and hopefully few prototypes,
which can conflict with char truncate64(); below. */
#include <assert.h>
/* Override any gcc2 internal prototype to avoid an error. */
/* We use char because int might match the return type of a gcc2
builtin and then its argument prototype would still apply. */
char truncate64();
int main() {
/* The GNU C library defines this for functions which it implements
to always fail with ENOSYS. Some functions are actually named
something starting with __ and the normal name is an alias. */
#if defined (__stub_truncate64) || defined (__stub___truncate64)
choke me
#else
truncate64();
#endif
; return 0; }
configure:12898: checking for setbuf
configure:12926: clang -o conftest -O2 -pipe -march=pentium4 -mtune=pentium4 -fno-strict-aliasing -fno-strict-aliasing -ffunction-sections -fdata-sections -fno-tree-vrp -Qunused-arguments -O2 -pipe -march=pentium4 -mtune=pentium4 -Wno-error -w -isystem/usr/local/include -I/usr/local/include -pthread -L/usr/local/lib -L/usr/local/lib -Wl,-z,origin -Wl,-rpath,\$$ORIGIN -Wl,-z,noexecstack conftest.c 1>&5
configure:12898: checking for isatty
configure:12926: clang -o conftest -O2 -pipe -march=pentium4 -mtune=pentium4 -fno-strict-aliasing -fno-strict-aliasing -ffunction-sections -fdata-sections -fno-tree-vrp -Qunused-arguments -O2 -pipe -march=pentium4 -mtune=pentium4 -Wno-error -w -isystem/usr/local/include -I/usr/local/include -pthread -L/usr/local/lib -L/usr/local/lib -Wl,-z,origin -Wl,-rpath,\$$ORIGIN -Wl,-z,noexecstack conftest.c 1>&5
configure:12956: checking for statvfs64
configure:12984: clang -o conftest -O2 -pipe -march=pentium4 -mtune=pentium4 -fno-strict-aliasing -fno-strict-aliasing -ffunction-sections -fdata-sections -fno-tree-vrp -Qunused-arguments -O2 -pipe -march=pentium4 -mtune=pentium4 -Wno-error -w -isystem/usr/local/include -I/usr/local/include -pthread -L/usr/local/lib -L/usr/local/lib -Wl,-z,origin -Wl,-rpath,\$$ORIGIN -Wl,-z,noexecstack conftest.c 1>&5
/tmp/conftest-NoB503.o: In function `main':
conftest.c:(.text.main+0x7): undefined reference to `statvfs64'
clang: error: linker command failed with exit code 1 (use -v to see invocation)
configure: failed program was:
#line 12961 "configure"
#include "confdefs.h"
/* System header to define __stub macros and hopefully few prototypes,
which can conflict with char statvfs64(); below. */
#include <assert.h>
/* Override any gcc2 internal prototype to avoid an error. */
/* We use char because int might match the return type of a gcc2
builtin and then its argument prototype would still apply. */
char statvfs64();
int main() {
/* The GNU C library defines this for functions which it implements
to always fail with ENOSYS. Some functions are actually named
something starting with __ and the normal name is an alias. */
#if defined (__stub_statvfs64) || defined (__stub___statvfs64)
choke me
#else
statvfs64();
#endif
; return 0; }
configure:12956: checking for statvfs
configure:12984: clang -o conftest -O2 -pipe -march=pentium4 -mtune=pentium4 -fno-strict-aliasing -fno-strict-aliasing -ffunction-sections -fdata-sections -fno-tree-vrp -Qunused-arguments -O2 -pipe -march=pentium4 -mtune=pentium4 -Wno-error -w -isystem/usr/local/include -I/usr/local/include -pthread -L/usr/local/lib -L/usr/local/lib -Wl,-z,origin -Wl,-rpath,\$$ORIGIN -Wl,-z,noexecstack conftest.c 1>&5
configure:12956: checking for statfs64
configure:12984: clang -o conftest -O2 -pipe -march=pentium4 -mtune=pentium4 -fno-strict-aliasing -fno-strict-aliasing -ffunction-sections -fdata-sections -fno-tree-vrp -Qunused-arguments -O2 -pipe -march=pentium4 -mtune=pentium4 -Wno-error -w -isystem/usr/local/include -I/usr/local/include -pthread -L/usr/local/lib -L/usr/local/lib -Wl,-z,origin -Wl,-rpath,\$$ORIGIN -Wl,-z,noexecstack conftest.c 1>&5
/tmp/conftest-FT3lZ7.o: In function `main':
conftest.c:(.text.main+0x7): undefined reference to `statfs64'
clang: error: linker command failed with exit code 1 (use -v to see invocation)
configure: failed program was:
#line 12961 "configure"
#include "confdefs.h"
/* System header to define __stub macros and hopefully few prototypes,
which can conflict with char statfs64(); below. */
#include <assert.h>
/* Override any gcc2 internal prototype to avoid an error. */
/* We use char because int might match the return type of a gcc2
builtin and then its argument prototype would still apply. */
char statfs64();
int main() {
/* The GNU C library defines this for functions which it implements
to always fail with ENOSYS. Some functions are actually named
something starting with __ and the normal name is an alias. */
#if defined (__stub_statfs64) || defined (__stub___statfs64)
choke me
#else
statfs64();
#endif
; return 0; }
configure:12956: checking for statfs
configure:12984: clang -o conftest -O2 -pipe -march=pentium4 -mtune=pentium4 -fno-strict-aliasing -fno-strict-aliasing -ffunction-sections -fdata-sections -fno-tree-vrp -Qunused-arguments -O2 -pipe -march=pentium4 -mtune=pentium4 -Wno-error -w -isystem/usr/local/include -I/usr/local/include -pthread -L/usr/local/lib -L/usr/local/lib -Wl,-z,origin -Wl,-rpath,\$$ORIGIN -Wl,-z,noexecstack conftest.c 1>&5
configure:13014: checking for flockfile
configure:13042: clang -o conftest -O2 -pipe -march=pentium4 -mtune=pentium4 -fno-strict-aliasing -fno-strict-aliasing -ffunction-sections -fdata-sections -fno-tree-vrp -Qunused-arguments -O2 -pipe -march=pentium4 -mtune=pentium4 -Wno-error -w -isystem/usr/local/include -I/usr/local/include -pthread -L/usr/local/lib -L/usr/local/lib -Wl,-z,origin -Wl,-rpath,\$$ORIGIN -Wl,-z,noexecstack conftest.c 1>&5
configure:13014: checking for getpagesize
configure:13042: clang -o conftest -O2 -pipe -march=pentium4 -mtune=pentium4 -fno-strict-aliasing -fno-strict-aliasing -ffunction-sections -fdata-sections -fno-tree-vrp -Qunused-arguments -O2 -pipe -march=pentium4 -mtune=pentium4 -Wno-error -w -isystem/usr/local/include -I/usr/local/include -pthread -L/usr/local/lib -L/usr/local/lib -Wl,-z,origin -Wl,-rpath,\$$ORIGIN -Wl,-z,noexecstack conftest.c 1>&5
configure:13072: checking for localtime_r
configure:13100: clang -o conftest -O2 -pipe -march=pentium4 -mtune=pentium4 -fno-strict-aliasing -fno-strict-aliasing -ffunction-sections -fdata-sections -fno-tree-vrp -Qunused-arguments -O2 -pipe -march=pentium4 -mtune=pentium4 -Wno-error -w -isystem/usr/local/include -I/usr/local/include -pthread -L/usr/local/lib -L/usr/local/lib -Wl,-z,origin -Wl,-rpath,\$$ORIGIN -Wl,-z,noexecstack conftest.c 1>&5
configure:13072: checking for strtok_r
configure:13100: clang -o conftest -O2 -pipe -march=pentium4 -mtune=pentium4 -fno-strict-aliasing -fno-strict-aliasing -ffunction-sections -fdata-sections -fno-tree-vrp -Qunused-arguments -O2 -pipe -march=pentium4 -mtune=pentium4 -Wno-error -w -isystem/usr/local/include -I/usr/local/include -pthread -L/usr/local/lib -L/usr/local/lib -Wl,-z,origin -Wl,-rpath,\$$ORIGIN -Wl,-z,noexecstack conftest.c 1>&5
configure:13129: checking for clock_gettime(CLOCK_MONOTONIC)
configure:13145: clang -o conftest -O2 -pipe -march=pentium4 -mtune=pentium4 -fno-strict-aliasing -fno-strict-aliasing -ffunction-sections -fdata-sections -fno-tree-vrp -Qunused-arguments -O2 -pipe -march=pentium4 -mtune=pentium4 -Wno-error -w -isystem/usr/local/include -I/usr/local/include -pthread -L/usr/local/lib -L/usr/local/lib -Wl,-z,origin -Wl,-rpath,\$$ORIGIN -Wl,-z,noexecstack conftest.c 1>&5
configure:13186: checking for wcrtomb
configure:13198: clang++ -o conftest -O2 -pipe -march=pentium4 -mtune=pentium4 -fno-strict-aliasing -O2 -pipe -march=pentium4 -mtune=pentium4 -Wno-error -w -fno-exceptions -fno-strict-aliasing -fno-rtti -ffunction-sections -fdata-sections -fno-exceptions -std=gnu++0x -fno-tree-vrp -Qunused-arguments -O2 -pipe -march=pentium4 -mtune=pentium4 -Wno-error -w -isystem/usr/local/include -I/usr/local/include -pthread -L/usr/local/lib -L/usr/local/lib -Wl,-z,origin -Wl,-rpath,\$$ORIGIN -Wl,-z,noexecstack conftest.C 1>&5
Stack dump:
0. Program arguments: /usr/bin/clang++ -cc1 -triple i386-unknown-freebsd9.0 -emit-obj -disable-free -main-file-name conftest.C -mrelocation-model static -mdisable-fp-elim -relaxed-aliasing -masm-verbose -mconstructor-aliases -target-cpu pentium4 -momit-leaf-frame-pointer -ffunction-sections -fdata-sections -resource-dir /usr/bin/../lib/clang/3.0 -isystem /usr/local/include -I /usr/local/include -fmodule-cache-path /tmp/clang-module-cache -O2 -Wno-error -Wno-error -w -std=gnu++0x -fdeprecated-macro -ferror-limit 19 -fmessage-length 0 -pthread -fno-rtti -fgnu-runtime -fobjc-runtime-has-arc -fobjc-runtime-has-weak -fobjc-fragile-abi -fdiagnostics-show-option -o /tmp/conftest-XYMh1N.o -x c++ conftest.C
1. <eof> parser at end of file
2. configure:13193:5: LLVM IR generation of declaration 'main'
3. configure:13193:5: Generating code for declaration 'main'
4. configure:13193:12: LLVM IR generation of compound statement ('{}')
clang++: error: unable to execute command: Illegal instruction: 4 (core dumped)
clang++: error: clang frontend command failed due to signal 2 (use -v to see invocation)
clang++: note: diagnostic msg: Please submit a bug report to http://llvm.org/bugs/ and include command line arguments and all diagnostic information.
clang++: note: diagnostic msg: Preprocessed source(s) are located at:
clang++: note: diagnostic msg: /tmp/conftest-P6UWJu.ii
configure: failed program was:
#line 13191 "configure"
#include "confdefs.h"
#include <wchar.h>
int main() {
mbstate_t ps={0};wcrtomb(0,'f',&ps);
; return 0; }
configure:13221: checking for mbrtowc
configure:13233: clang++ -o conftest -O2 -pipe -march=pentium4 -mtune=pentium4 -fno-strict-aliasing -O2 -pipe -march=pentium4 -mtune=pentium4 -Wno-error -w -fno-exceptions -fno-strict-aliasing -fno-rtti -ffunction-sections -fdata-sections -fno-exceptions -std=gnu++0x -fno-tree-vrp -Qunused-arguments -O2 -pipe -march=pentium4 -mtune=pentium4 -Wno-error -w -isystem/usr/local/include -I/usr/local/include -pthread -L/usr/local/lib -L/usr/local/lib -Wl,-z,origin -Wl,-rpath,\$$ORIGIN -Wl,-z,noexecstack conftest.C 1>&5
Stack dump:
0. Program arguments: /usr/bin/clang++ -cc1 -triple i386-unknown-freebsd9.0 -emit-obj -disable-free -main-file-name conftest.C -mrelocation-model static -mdisable-fp-elim -relaxed-aliasing -masm-verbose -mconstructor-aliases -target-cpu pentium4 -momit-leaf-frame-pointer -ffunction-sections -fdata-sections -resource-dir /usr/bin/../lib/clang/3.0 -isystem /usr/local/include -I /usr/local/include -fmodule-cache-path /tmp/clang-module-cache -O2 -Wno-error -Wno-error -w -std=gnu++0x -fdeprecated-macro -ferror-limit 19 -fmessage-length 0 -pthread -fno-rtti -fgnu-runtime -fobjc-runtime-has-arc -fobjc-runtime-has-weak -fobjc-fragile-abi -fdiagnostics-show-option -o /tmp/conftest-CZR5bh.o -x c++ conftest.C
1. <eof> parser at end of file
2. configure:13228:5: LLVM IR generation of declaration 'main'
3. configure:13228:5: Generating code for declaration 'main'
4. configure:13228:12: LLVM IR generation of compound statement ('{}')
clang++: error: unable to execute command: Illegal instruction: 4 (core dumped)
clang++: error: clang frontend command failed due to signal 2 (use -v to see invocation)
clang++: note: diagnostic msg: Please submit a bug report to http://llvm.org/bugs/ and include command line arguments and all diagnostic information.
clang++: note: diagnostic msg: Preprocessed source(s) are located at:
clang++: note: diagnostic msg: /tmp/conftest-626jBX.ii
configure: failed program was:
#line 13226 "configure"
#include "confdefs.h"
#include <wchar.h>
int main() {
mbstate_t ps={0};mbrtowc(0,0,0,&ps);
; return 0; }
configure:13265: checking for res_ninit()
configure:13282: clang -o conftest -O2 -pipe -march=pentium4 -mtune=pentium4 -fno-strict-aliasing -fno-strict-aliasing -ffunction-sections -fdata-sections -fno-tree-vrp -Qunused-arguments -O2 -pipe -march=pentium4 -mtune=pentium4 -Wno-error -w -isystem/usr/local/include -I/usr/local/include -pthread -L/usr/local/lib -L/usr/local/lib -Wl,-z,origin -Wl,-rpath,\$$ORIGIN -Wl,-z,noexecstack conftest.c 1>&5
In file included from configure:13275:
/usr/include/resolv.h:157:14: error: array has incomplete element type 'struct sockaddr_in'
nsaddr_list[MAXNS]; /*%< address of name server */
^
/usr/include/resolv.h:156:9: note: forward declaration of 'struct sockaddr_in'
struct sockaddr_in
^
/usr/include/resolv.h:171:18: error: field has incomplete type 'struct in_addr'
struct in_addr addr;
^
/usr/include/resolv.h:171:10: note: forward declaration of 'struct in_addr'
struct in_addr addr;
^
/usr/include/resolv.h:195:21: error: field has incomplete type 'struct sockaddr_in'
struct sockaddr_in sin;
^
/usr/include/resolv.h:156:9: note: forward declaration of 'struct sockaddr_in'
struct sockaddr_in
^
3 errors generated.
configure: failed program was:
#line 13270 "configure"
#include "confdefs.h"
#ifdef linux
#define _BSD_SOURCE 1
#endif
#include <resolv.h>
int main() {
int foo = res_ninit(&_res);
; return 0; }
configure:13315: checking for gnu_get_libc_version()
configure:13331: clang++ -o conftest -O2 -pipe -march=pentium4 -mtune=pentium4 -fno-strict-aliasing -O2 -pipe -march=pentium4 -mtune=pentium4 -Wno-error -w -fno-exceptions -fno-strict-aliasing -fno-rtti -ffunction-sections -fdata-sections -fno-exceptions -std=gnu++0x -fno-tree-vrp -Qunused-arguments -O2 -pipe -march=pentium4 -mtune=pentium4 -Wno-error -w -isystem/usr/local/include -I/usr/local/include -pthread -L/usr/local/lib -L/usr/local/lib -Wl,-z,origin -Wl,-rpath,\$$ORIGIN -Wl,-z,noexecstack conftest.C 1>&5
configure:13327:29: error: use of undeclared identifier 'gnu_get_libc_version'
const char *glibc_version = gnu_get_libc_version();
^
1 error generated.
configure: failed program was:
#line 13320 "configure"
#include "confdefs.h"
#ifdef HAVE_GNU_LIBC_VERSION_H
#include <gnu/libc-version.h>
#endif
int main() {
const char *glibc_version = gnu_get_libc_version();
; return 0; }
configure:13363: checking for iconv in -lc
configure:13385: clang++ -o conftest -O2 -pipe -march=pentium4 -mtune=pentium4 -fno-strict-aliasing -O2 -pipe -march=pentium4 -mtune=pentium4 -Wno-error -w -fno-exceptions -fno-strict-aliasing -fno-rtti -ffunction-sections -fdata-sections -fno-exceptions -std=gnu++0x -fno-tree-vrp -Qunused-arguments -O2 -pipe -march=pentium4 -mtune=pentium4 -Wno-error -w -isystem/usr/local/include -I/usr/local/include -pthread -L/usr/local/lib -L/usr/local/lib -Wl,-z,origin -Wl,-rpath,\$$ORIGIN -Wl,-z,noexecstack conftest.C -lc 1>&5
/tmp/conftest-wJc1i3.o: In function `main':
conftest.C:(.text.main+0x7): undefined reference to `iconv'
clang++: error: linker command failed with exit code 1 (use -v to see invocation)
configure: failed program was:
#line 13371 "configure"
#include "confdefs.h"
/* Override any gcc2 internal prototype to avoid an error. */
#ifdef __cplusplus
extern "C"
#endif
/* We use char because int might match the return type of a gcc2
builtin and then its argument prototype would still apply. */
char iconv();
int main() {
iconv()
; return 0; }
configure:13404: checking for iconv in -liconv
configure:13426: clang++ -o conftest -O2 -pipe -march=pentium4 -mtune=pentium4 -fno-strict-aliasing -O2 -pipe -march=pentium4 -mtune=pentium4 -Wno-error -w -fno-exceptions -fno-strict-aliasing -fno-rtti -ffunction-sections -fdata-sections -fno-exceptions -std=gnu++0x -fno-tree-vrp -Qunused-arguments -O2 -pipe -march=pentium4 -mtune=pentium4 -Wno-error -w -isystem/usr/local/include -I/usr/local/include -pthread -L/usr/local/lib -L/usr/local/lib -Wl,-z,origin -Wl,-rpath,\$$ORIGIN -Wl,-z,noexecstack conftest.C -liconv 1>&5
configure:13494: checking for iconv()
configure:13513: clang++ -o conftest -O2 -pipe -march=pentium4 -mtune=pentium4 -fno-strict-aliasing -O2 -pipe -march=pentium4 -mtune=pentium4 -Wno-error -w -fno-exceptions -fno-strict-aliasing -fno-rtti -ffunction-sections -fdata-sections -fno-exceptions -std=gnu++0x -fno-tree-vrp -Qunused-arguments -O2 -pipe -march=pentium4 -mtune=pentium4 -Wno-error -w -isystem/usr/local/include -I/usr/local/include -pthread -L/usr/local/lib -L/usr/local/lib -Wl,-z,origin -Wl,-rpath,\$$ORIGIN -Wl,-z,noexecstack conftest.C -liconv 1>&5
configure:13540: checking for iconv() with const input
configure:13560: clang++ -c -O2 -pipe -march=pentium4 -mtune=pentium4 -fno-strict-aliasing -O2 -pipe -march=pentium4 -mtune=pentium4 -Wno-error -w -fno-exceptions -fno-strict-aliasing -fno-rtti -ffunction-sections -fdata-sections -fno-exceptions -std=gnu++0x -fno-tree-vrp -Qunused-arguments -O2 -pipe -march=pentium4 -mtune=pentium4 -Wno-error -w -isystem/usr/local/include -I/usr/local/include conftest.C 1>&5
configure:13592: checking for nl_langinfo and CODESET
configure:13604: clang++ -o conftest -O2 -pipe -march=pentium4 -mtune=pentium4 -fno-strict-aliasing -O2 -pipe -march=pentium4 -mtune=pentium4 -Wno-error -w -fno-exceptions -fno-strict-aliasing -fno-rtti -ffunction-sections -fdata-sections -fno-exceptions -std=gnu++0x -fno-tree-vrp -Qunused-arguments -O2 -pipe -march=pentium4 -mtune=pentium4 -Wno-error -w -isystem/usr/local/include -I/usr/local/include -pthread -L/usr/local/lib -L/usr/local/lib -Wl,-z,origin -Wl,-rpath,\$$ORIGIN -Wl,-z,noexecstack conftest.C 1>&5
configure:13639: checking for an implementation of va_copy()
configure:13663: clang -o conftest -O2 -pipe -march=pentium4 -mtune=pentium4 -fno-strict-aliasing -fno-strict-aliasing -ffunction-sections -fdata-sections -fno-tree-vrp -Qunused-arguments -O2 -pipe -march=pentium4 -mtune=pentium4 -Wno-error -w -isystem/usr/local/include -I/usr/local/include -pthread -L/usr/local/lib -L/usr/local/lib -Wl,-z,origin -Wl,-rpath,\$$ORIGIN -Wl,-z,noexecstack conftest.c 1>&5
configure:13680: checking for an implementation of __va_copy()
configure:13704: clang -o conftest -O2 -pipe -march=pentium4 -mtune=pentium4 -fno-strict-aliasing -fno-strict-aliasing -ffunction-sections -fdata-sections -fno-tree-vrp -Qunused-arguments -O2 -pipe -march=pentium4 -mtune=pentium4 -Wno-error -w -isystem/usr/local/include -I/usr/local/include -pthread -L/usr/local/lib -L/usr/local/lib -Wl,-z,origin -Wl,-rpath,\$$ORIGIN -Wl,-z,noexecstack conftest.c 1>&5
/tmp/conftest-TDwckJ.o: In function `f':
conftest.c:(.text.f+0x17): undefined reference to `__va_copy'
clang: error: linker command failed with exit code 1 (use -v to see invocation)
configure: failed program was:
#line 13690 "configure"
#include "confdefs.h"
#include <stdarg.h>
void f (int i, ...) {
va_list args1, args2;
va_start (args1, i);
__va_copy (args2, args1);
if (va_arg (args2, int) != 42 || va_arg (args1, int) != 42)
exit (1);
va_end (args1); va_end (args2);
}
int main() { f (0, 42); return 0; }
configure:13721: checking whether va_lists can be copied by value
configure:13745: clang -o conftest -O2 -pipe -march=pentium4 -mtune=pentium4 -fno-strict-aliasing -fno-strict-aliasing -ffunction-sections -fdata-sections -fno-tree-vrp -Qunused-arguments -O2 -pipe -march=pentium4 -mtune=pentium4 -Wno-error -w -isystem/usr/local/include -I/usr/local/include -pthread -L/usr/local/lib -L/usr/local/lib -Wl,-z,origin -Wl,-rpath,\$$ORIGIN -Wl,-z,noexecstack conftest.c 1>&5
configure:13858: checking for modern C++ template specialization syntax support
configure:13873: clang++ -c -O2 -pipe -march=pentium4 -mtune=pentium4 -fno-strict-aliasing -O2 -pipe -march=pentium4 -mtune=pentium4 -Wno-error -w -fno-exceptions -fno-strict-aliasing -fno-rtti -ffunction-sections -fdata-sections -fno-exceptions -std=gnu++0x -fno-tree-vrp -Qunused-arguments -O2 -pipe -march=pentium4 -mtune=pentium4 -Wno-error -w -isystem/usr/local/include -I/usr/local/include conftest.C 1>&5
configure:13891: checking whether partial template specialization works
configure:13904: clang++ -c -O2 -pipe -march=pentium4 -mtune=pentium4 -fno-strict-aliasing -O2 -pipe -march=pentium4 -mtune=pentium4 -Wno-error -w -fno-exceptions -fno-strict-aliasing -fno-rtti -ffunction-sections -fdata-sections -fno-exceptions -std=gnu++0x -fno-tree-vrp -Qunused-arguments -O2 -pipe -march=pentium4 -mtune=pentium4 -Wno-error -w -isystem/usr/local/include -I/usr/local/include conftest.C 1>&5
configure:13928: checking whether the C++ "using" keyword resolves ambiguity
configure:13949: clang++ -c -O2 -pipe -march=pentium4 -mtune=pentium4 -fno-strict-aliasing -O2 -pipe -march=pentium4 -mtune=pentium4 -Wno-error -w -fno-exceptions -fno-strict-aliasing -fno-rtti -ffunction-sections -fdata-sections -fno-exceptions -std=gnu++0x -fno-tree-vrp -Qunused-arguments -O2 -pipe -march=pentium4 -mtune=pentium4 -Wno-error -w -isystem/usr/local/include -I/usr/local/include conftest.C 1>&5
configure:13973: checking for C++ dynamic_cast to void*
configure:14000: clang++ -o conftest -O2 -pipe -march=pentium4 -mtune=pentium4 -fno-strict-aliasing -O2 -pipe -march=pentium4 -mtune=pentium4 -Wno-error -w -fno-exceptions -fno-strict-aliasing -fno-rtti -ffunction-sections -fdata-sections -fno-exceptions -std=gnu++0x -fno-tree-vrp -Qunused-arguments -O2 -pipe -march=pentium4 -mtune=pentium4 -Wno-error -w -isystem/usr/local/include -I/usr/local/include -pthread -L/usr/local/lib -L/usr/local/lib -Wl,-z,origin -Wl,-rpath,\$$ORIGIN -Wl,-z,noexecstack conftest.C 1>&5
configure:14027: checking whether C++ requires implementation of unused virtual methods
configure:14039: clang++ -o conftest -O2 -pipe -march=pentium4 -mtune=pentium4 -fno-strict-aliasing -O2 -pipe -march=pentium4 -mtune=pentium4 -Wno-error -w -fno-exceptions -fno-strict-aliasing -fno-rtti -ffunction-sections -fdata-sections -fno-exceptions -std=gnu++0x -fno-tree-vrp -Qunused-arguments -O2 -pipe -march=pentium4 -mtune=pentium4 -Wno-error -w -isystem/usr/local/include -I/usr/local/include -pthread -L/usr/local/lib -L/usr/local/lib -Wl,-z,origin -Wl,-rpath,\$$ORIGIN -Wl,-z,noexecstack conftest.C 1>&5
configure:14065: checking for trouble comparing to zero near std::operator!=()
configure:14081: clang++ -c -O2 -pipe -march=pentium4 -mtune=pentium4 -fno-strict-aliasing -O2 -pipe -march=pentium4 -mtune=pentium4 -Wno-error -w -fno-exceptions -fno-strict-aliasing -fno-rtti -ffunction-sections -fdata-sections -fno-exceptions -std=gnu++0x -fno-tree-vrp -Qunused-arguments -O2 -pipe -march=pentium4 -mtune=pentium4 -Wno-error -w -isystem/usr/local/include -I/usr/local/include conftest.C 1>&5
configure:14111: checking for __thread keyword for TLS variables
configure:14210: checking for malloc.h
configure:14210: checking for malloc_np.h
configure:14223: clang++ -c -O2 -pipe -march=pentium4 -mtune=pentium4 -fno-strict-aliasing -O2 -pipe -march=pentium4 -mtune=pentium4 -Wno-error -w -fno-exceptions -fno-strict-aliasing -fno-rtti -ffunction-sections -fdata-sections -fno-exceptions -std=gnu++0x -fno-tree-vrp -Qunused-arguments -O2 -pipe -march=pentium4 -mtune=pentium4 -Wno-error -w -isystem/usr/local/include -I/usr/local/include conftest.C 1>&5
configure:14259: checking for strndup
configure:14290: clang++ -o conftest -O2 -pipe -march=pentium4 -mtune=pentium4 -fno-strict-aliasing -O2 -pipe -march=pentium4 -mtune=pentium4 -Wno-error -w -fno-exceptions -fno-strict-aliasing -fno-rtti -ffunction-sections -fdata-sections -fno-exceptions -std=gnu++0x -fno-tree-vrp -Qunused-arguments -O2 -pipe -march=pentium4 -mtune=pentium4 -Wno-error -w -isystem/usr/local/include -I/usr/local/include -pthread -L/usr/local/lib -L/usr/local/lib -Wl,-z,origin -Wl,-rpath,\$$ORIGIN -Wl,-z,noexecstack conftest.C 1>&5
configure:14259: checking for posix_memalign
configure:14290: clang++ -o conftest -O2 -pipe -march=pentium4 -mtune=pentium4 -fno-strict-aliasing -O2 -pipe -march=pentium4 -mtune=pentium4 -Wno-error -w -fno-exceptions -fno-strict-aliasing -fno-rtti -ffunction-sections -fdata-sections -fno-exceptions -std=gnu++0x -fno-tree-vrp -Qunused-arguments -O2 -pipe -march=pentium4 -mtune=pentium4 -Wno-error -w -isystem/usr/local/include -I/usr/local/include -pthread -L/usr/local/lib -L/usr/local/lib -Wl,-z,origin -Wl,-rpath,\$$ORIGIN -Wl,-z,noexecstack conftest.C 1>&5
configure:14259: checking for memalign
configure:14290: clang++ -o conftest -O2 -pipe -march=pentium4 -mtune=pentium4 -fno-strict-aliasing -O2 -pipe -march=pentium4 -mtune=pentium4 -Wno-error -w -fno-exceptions -fno-strict-aliasing -fno-rtti -ffunction-sections -fdata-sections -fno-exceptions -std=gnu++0x -fno-tree-vrp -Qunused-arguments -O2 -pipe -march=pentium4 -mtune=pentium4 -Wno-error -w -isystem/usr/local/include -I/usr/local/include -pthread -L/usr/local/lib -L/usr/local/lib -Wl,-z,origin -Wl,-rpath,\$$ORIGIN -Wl,-z,noexecstack conftest.C 1>&5
/tmp/conftest-uDRiet.o: In function `main':
conftest.C:(.text.main+0x7): undefined reference to `memalign'
clang++: error: linker command failed with exit code 1 (use -v to see invocation)
configure: failed program was:
#line 14264 "configure"
#include "confdefs.h"
/* System header to define __stub macros and hopefully few prototypes,
which can conflict with char memalign(); below. */
#include <assert.h>
/* Override any gcc2 internal prototype to avoid an error. */
#ifdef __cplusplus
extern "C"
#endif
/* We use char because int might match the return type of a gcc2
builtin and then its argument prototype would still apply. */
char memalign();
int main() {
/* The GNU C library defines this for functions which it implements
to always fail with ENOSYS. Some functions are actually named
something starting with __ and the normal name is an alias. */
#if defined (__stub_memalign) || defined (__stub___memalign)
choke me
#else
memalign();
#endif
; return 0; }
configure:14259: checking for valloc
configure:14290: clang++ -o conftest -O2 -pipe -march=pentium4 -mtune=pentium4 -fno-strict-aliasing -O2 -pipe -march=pentium4 -mtune=pentium4 -Wno-error -w -fno-exceptions -fno-strict-aliasing -fno-rtti -ffunction-sections -fdata-sections -fno-exceptions -std=gnu++0x -fno-tree-vrp -Qunused-arguments -O2 -pipe -march=pentium4 -mtune=pentium4 -Wno-error -w -isystem/usr/local/include -I/usr/local/include -pthread -L/usr/local/lib -L/usr/local/lib -Wl,-z,origin -Wl,-rpath,\$$ORIGIN -Wl,-z,noexecstack conftest.C 1>&5
configure:14321: checking for malloc_usable_size
configure:14352: clang++ -o conftest -O2 -pipe -march=pentium4 -mtune=pentium4 -fno-strict-aliasing -O2 -pipe -march=pentium4 -mtune=pentium4 -Wno-error -w -fno-exceptions -fno-strict-aliasing -fno-rtti -ffunction-sections -fdata-sections -fno-exceptions -std=gnu++0x -fno-tree-vrp -Qunused-arguments -O2 -pipe -march=pentium4 -mtune=pentium4 -Wno-error -w -isystem/usr/local/include -I/usr/local/include -pthread -L/usr/local/lib -L/usr/local/lib -Wl,-z,origin -Wl,-rpath,\$$ORIGIN -Wl,-z,noexecstack conftest.C 1>&5
configure:14382: checking for __attribute__((always_inline))
configure:14394: clang++ -c -O2 -pipe -march=pentium4 -mtune=pentium4 -fno-strict-aliasing -O2 -pipe -march=pentium4 -mtune=pentium4 -Wno-error -w -fno-exceptions -fno-strict-aliasing -fno-rtti -ffunction-sections -fdata-sections -fno-exceptions -std=gnu++0x -fno-tree-vrp -Qunused-arguments -O2 -pipe -march=pentium4 -mtune=pentium4 -Wno-error -w -isystem/usr/local/include -I/usr/local/include conftest.C 1>&5
configure:14409: checking for __attribute__((malloc))
configure:14421: clang++ -c -O2 -pipe -march=pentium4 -mtune=pentium4 -fno-strict-aliasing -O2 -pipe -march=pentium4 -mtune=pentium4 -Wno-error -w -fno-exceptions -fno-strict-aliasing -fno-rtti -ffunction-sections -fdata-sections -fno-exceptions -std=gnu++0x -fno-tree-vrp -Qunused-arguments -O2 -pipe -march=pentium4 -mtune=pentium4 -Wno-error -w -isystem/usr/local/include -I/usr/local/include conftest.C 1>&5
configure:14436: checking for __attribute__((warn_unused_result))
configure:14448: clang++ -c -O2 -pipe -march=pentium4 -mtune=pentium4 -fno-strict-aliasing -O2 -pipe -march=pentium4 -mtune=pentium4 -Wno-error -w -fno-exceptions -fno-strict-aliasing -fno-rtti -ffunction-sections -fdata-sections -fno-exceptions -std=gnu++0x -fno-tree-vrp -Qunused-arguments -O2 -pipe -march=pentium4 -mtune=pentium4 -Wno-error -w -isystem/usr/local/include -I/usr/local/include conftest.C 1>&5
configure:14472: checking for LC_MESSAGES
configure:14484: clang -c -O2 -pipe -march=pentium4 -mtune=pentium4 -fno-strict-aliasing -fno-strict-aliasing -ffunction-sections -fdata-sections -fno-tree-vrp -Qunused-arguments -O2 -pipe -march=pentium4 -mtune=pentium4 -Wno-error -w -isystem/usr/local/include -I/usr/local/include conftest.c 1>&5
configure:14510: checking for localeconv
configure:14538: clang -o conftest -O2 -pipe -march=pentium4 -mtune=pentium4 -fno-strict-aliasing -fno-strict-aliasing -ffunction-sections -fdata-sections -fno-tree-vrp -Qunused-arguments -O2 -pipe -march=pentium4 -mtune=pentium4 -Wno-error -w -isystem/usr/local/include -I/usr/local/include -pthread -L/usr/local/lib -L/usr/local/lib -Wl,-z,origin -Wl,-rpath,\$$ORIGIN -Wl,-z,noexecstack conftest.c 1>&5
configure:14727: checking for nspr-config
configure:14762: checking for NSPR - version >= 4.9.4
configure:14830: clang -c -O2 -pipe -march=pentium4 -mtune=pentium4 -fno-strict-aliasing -fno-strict-aliasing -ffunction-sections -fdata-sections -fno-tree-vrp -I/usr/local/include/nspr -Qunused-arguments -O2 -pipe -march=pentium4 -mtune=pentium4 -Wno-error -w -isystem/usr/local/include -I/usr/local/include conftest.c 1>&5
configure:14850: clang -c -O2 -pipe -march=pentium4 -mtune=pentium4 -fno-strict-aliasing -fno-strict-aliasing -ffunction-sections -fdata-sections -fno-tree-vrp -I/usr/local/include/nspr -Qunused-arguments -O2 -pipe -march=pentium4 -mtune=pentium4 -Wno-error -w -isystem/usr/local/include -I/usr/local/include conftest.c 1>&5
configure:14899: checking for pkg-config
configure:14943: checking for libevent
configure:14950: checking MOZ_LIBEVENT_CFLAGS
configure:14955: checking MOZ_LIBEVENT_LIBS
configure:15130: checking for nss-config
configure:15165: checking for NSS - version >= 3.14.1
configure:15238: checking for YASM assembler
configure:15244: checking for yasm
configure:15302: checking for jpeg_destroy_compress in -ljpeg
configure:15321: clang -o conftest -I/usr/local/include -O2 -pipe -march=pentium4 -mtune=pentium4 -fno-strict-aliasing -fno-strict-aliasing -ffunction-sections -fdata-sections -fno-tree-vrp -Qunused-arguments -O2 -pipe -march=pentium4 -mtune=pentium4 -Wno-error -w -isystem/usr/local/include -I/usr/local/include -L/usr/local/lib -pthread -L/usr/local/lib -L/usr/local/lib -Wl,-z,origin -Wl,-rpath,\$$ORIGIN -Wl,-z,noexecstack conftest.c -ljpeg 1>&5
configure:15357: clang -c -I/usr/local/include -O2 -pipe -march=pentium4 -mtune=pentium4 -fno-strict-aliasing -fno-strict-aliasing -ffunction-sections -fdata-sections -fno-tree-vrp -Qunused-arguments -O2 -pipe -march=pentium4 -mtune=pentium4 -Wno-error -w -isystem/usr/local/include -I/usr/local/include conftest.c 1>&5
configure:15404: checking for gzread in -lz
configure:15423: clang -o conftest -O2 -pipe -march=pentium4 -mtune=pentium4 -fno-strict-aliasing -fno-strict-aliasing -ffunction-sections -fdata-sections -fno-tree-vrp -Qunused-arguments -O2 -pipe -march=pentium4 -mtune=pentium4 -Wno-error -w -isystem/usr/local/include -I/usr/local/include -pthread -L/usr/local/lib -L/usr/local/lib -Wl,-z,origin -Wl,-rpath,\$$ORIGIN -Wl,-z,noexecstack conftest.c -lz 1>&5
configure:15458: clang -c -O2 -pipe -march=pentium4 -mtune=pentium4 -fno-strict-aliasing -fno-strict-aliasing -ffunction-sections -fdata-sections -fno-tree-vrp -Qunused-arguments -O2 -pipe -march=pentium4 -mtune=pentium4 -Wno-error -w -isystem/usr/local/include -I/usr/local/include conftest.c 1>&5
configure:15509: checking for BZ2_bzread in -lbz2
configure:15528: clang -o conftest -O2 -pipe -march=pentium4 -mtune=pentium4 -fno-strict-aliasing -fno-strict-aliasing -ffunction-sections -fdata-sections -fno-tree-vrp -Qunused-arguments -O2 -pipe -march=pentium4 -mtune=pentium4 -Wno-error -w -isystem/usr/local/include -I/usr/local/include -pthread -L/usr/local/lib -L/usr/local/lib -Wl,-z,origin -Wl,-rpath,\$$ORIGIN -Wl,-z,noexecstack conftest.c -lbz2 1>&5
configure:15577: checking for png_get_valid in -lpng
configure:15596: clang -o conftest -I/usr/local/include -O2 -pipe -march=pentium4 -mtune=pentium4 -fno-strict-aliasing -fno-strict-aliasing -ffunction-sections -fdata-sections -fno-tree-vrp -Qunused-arguments -O2 -pipe -march=pentium4 -mtune=pentium4 -Wno-error -w -isystem/usr/local/include -I/usr/local/include -L/usr/local/lib -pthread -L/usr/local/lib -L/usr/local/lib -Wl,-z,origin -Wl,-rpath,\$$ORIGIN -Wl,-z,noexecstack conftest.c -lpng 1>&5
configure:15618: checking for png_get_acTL in -lpng
configure:15637: clang -o conftest -I/usr/local/include -O2 -pipe -march=pentium4 -mtune=pentium4 -fno-strict-aliasing -fno-strict-aliasing -ffunction-sections -fdata-sections -fno-tree-vrp -Qunused-arguments -O2 -pipe -march=pentium4 -mtune=pentium4 -Wno-error -w -isystem/usr/local/include -I/usr/local/include -L/usr/local/lib -pthread -L/usr/local/lib -L/usr/local/lib -Wl,-z,origin -Wl,-rpath,\$$ORIGIN -Wl,-z,noexecstack conftest.c -lpng 1>&5
configure:15685: clang -c -I/usr/local/include -O2 -pipe -march=pentium4 -mtune=pentium4 -fno-strict-aliasing -fno-strict-aliasing -ffunction-sections -fdata-sections -fno-tree-vrp -Qunused-arguments -O2 -pipe -march=pentium4 -mtune=pentium4 -Wno-error -w -isystem/usr/local/include -I/usr/local/include conftest.c 1>&5
configure:15771: checking for hunspell
configure:15778: checking MOZ_HUNSPELL_CFLAGS
configure:15783: checking MOZ_HUNSPELL_LIBS
configure:15975: checking for libffi >= 3.0.9
configure:15982: checking MOZ_FFI_CFLAGS
configure:15987: checking MOZ_FFI_LIBS
configure:16175: checking for application to build
configure:16218: checking if app-specific confvars.sh exists
configure:16676: checking for gtk+-2.0 >= 2.10.0 gtk+-unix-print-2.0 glib-2.0 gobject-2.0 gdk-x11-2.0
configure:16683: checking MOZ_GTK2_CFLAGS
configure:16688: checking MOZ_GTK2_LIBS
configure:16814: checking for libstartup-notification-1.0 >= 0.8
configure:16821: checking MOZ_STARTUP_NOTIFICATION_CFLAGS
configure:16826: checking MOZ_STARTUP_NOTIFICATION_LIBS
configure:17713: checking for pango >= 1.14.0
configure:17720: checking _PANGOCHK_CFLAGS
configure:17725: checking _PANGOCHK_LIBS
configure:17805: checking for pango >= 1.14.0 pangoft2 >= 1.14.0 pangocairo >= 1.14.0
configure:17812: checking MOZ_PANGO_CFLAGS
configure:17817: checking MOZ_PANGO_LIBS
configure:18373: checking for gconf-2.0 >= 1.2.1 gobject-2.0
configure:18380: checking MOZ_GCONF_CFLAGS
configure:18385: checking MOZ_GCONF_LIBS
configure:18774: checking for dbus-1 >= 0.60
configure:18781: checking MOZ_DBUS_CFLAGS
configure:18786: checking MOZ_DBUS_LIBS
configure:18865: checking for dbus-glib-1 >= 0.60
configure:18872: checking MOZ_DBUS_GLIB_CFLAGS
configure:18877: checking MOZ_DBUS_GLIB_LIBS
configure:19383: checking __attribute__ ((aligned ())) support
configure:19400: clang -c -O2 -pipe -march=pentium4 -mtune=pentium4 -fno-strict-aliasing -fno-strict-aliasing -ffunction-sections -fdata-sections -fno-tree-vrp -Werror -Qunused-arguments -O2 -pipe -march=pentium4 -mtune=pentium4 -Wno-error -w -isystem/usr/local/include -I/usr/local/include conftest.c 1>&5
configure:19667: checking for vpx >= 1.0.0
configure:19674: checking MOZ_LIBVPX_CFLAGS
configure:19679: checking MOZ_LIBVPX_LIBS
configure:19711: checking for vpx/vpx_decoder.h
configure:19724: clang -c -O2 -pipe -march=pentium4 -mtune=pentium4 -fno-strict-aliasing -fno-strict-aliasing -ffunction-sections -fdata-sections -fno-tree-vrp -Qunused-arguments -O2 -pipe -march=pentium4 -mtune=pentium4 -Wno-error -w -isystem/usr/local/include -I/usr/local/include conftest.c 1>&5
configure:19747: checking for vpx_codec_dec_init_ver in -lvpx
configure:19766: clang -o conftest -O2 -pipe -march=pentium4 -mtune=pentium4 -fno-strict-aliasing -fno-strict-aliasing -ffunction-sections -fdata-sections -fno-tree-vrp -Qunused-arguments -O2 -pipe -march=pentium4 -mtune=pentium4 -Wno-error -w -isystem/usr/local/include -I/usr/local/include -pthread -L/usr/local/lib -L/usr/local/lib -Wl,-z,origin -Wl,-rpath,\$$ORIGIN -Wl,-z,noexecstack conftest.c -lvpx 1>&5
configure:20360: checking for gstreamer-0.10 >= 0.10.33
gstreamer-app-0.10
gstreamer-plugins-base-0.10
configure:20371: checking GSTREAMER_CFLAGS
configure:20378: checking GSTREAMER_LIBS
configure:20424: clang -o conftest -O2 -pipe -march=pentium4 -mtune=pentium4 -fno-strict-aliasing -fno-strict-aliasing -ffunction-sections -fdata-sections -fno-tree-vrp -Qunused-arguments -O2 -pipe -march=pentium4 -mtune=pentium4 -Wno-error -w -isystem/usr/local/include -I/usr/local/include -pthread -L/usr/local/lib -L/usr/local/lib -Wl,-z,origin -Wl,-rpath,\$$ORIGIN -Wl,-z,noexecstack -lgstapp-0.10 -lgstbase-0.10 -lgstreamer-0.10 -lgobject-2.0 -lgmodule-2.0 -lgthread-2.0 -pthread -lglib-2.0 -L/usr/local/lib -lxml2 -lgstvideo-0.10 conftest.c 1>&5
configure:20544: checking for java
configure:20593: checking for javac
configure:20642: checking for jar
configure:21405: checking for tar archiver
configure:21411: checking for gnutar
configure:21411: checking for gtar
configure:21448: checking for wget
configure:21454: checking for wget
configure:21762: checking for sqlite3 >= 3.7.14.1
configure:21769: checking SQLITE_CFLAGS
configure:21774: checking SQLITE_LIBS
configure:21805: checking for SQLITE_SECURE_DELETE support in system SQLite
configure:21828: clang -o conftest -O2 -pipe -march=pentium4 -mtune=pentium4 -fno-strict-aliasing -fno-strict-aliasing -ffunction-sections -fdata-sections -fno-tree-vrp -I/usr/local/include -Qunused-arguments -O2 -pipe -march=pentium4 -mtune=pentium4 -Wno-error -w -isystem/usr/local/include -I/usr/local/include -pthread -L/usr/local/lib -L/usr/local/lib -Wl,-z,origin -Wl,-rpath,\$$ORIGIN -Wl,-z,noexecstack conftest.c -L/usr/local/lib -lsqlite3 1>&5
configure:21851: checking for SQLITE_THREADSAFE support in system SQLite
configure:21874: clang -o conftest -O2 -pipe -march=pentium4 -mtune=pentium4 -fno-strict-aliasing -fno-strict-aliasing -ffunction-sections -fdata-sections -fno-tree-vrp -I/usr/local/include -Qunused-arguments -O2 -pipe -march=pentium4 -mtune=pentium4 -Wno-error -w -isystem/usr/local/include -I/usr/local/include -pthread -L/usr/local/lib -L/usr/local/lib -Wl,-z,origin -Wl,-rpath,\$$ORIGIN -Wl,-z,noexecstack conftest.c -L/usr/local/lib -lsqlite3 1>&5
configure:21897: checking for SQLITE_ENABLE_FTS3 support in system SQLite
configure:21920: clang -o conftest -O2 -pipe -march=pentium4 -mtune=pentium4 -fno-strict-aliasing -fno-strict-aliasing -ffunction-sections -fdata-sections -fno-tree-vrp -I/usr/local/include -Qunused-arguments -O2 -pipe -march=pentium4 -mtune=pentium4 -Wno-error -w -isystem/usr/local/include -I/usr/local/include -pthread -L/usr/local/lib -L/usr/local/lib -Wl,-z,origin -Wl,-rpath,\$$ORIGIN -Wl,-z,noexecstack conftest.c -L/usr/local/lib -lsqlite3 1>&5
configure:21943: checking for SQLITE_ENABLE_UNLOCK_NOTIFY support in system SQLite
configure:21966: clang -o conftest -O2 -pipe -march=pentium4 -mtune=pentium4 -fno-strict-aliasing -fno-strict-aliasing -ffunction-sections -fdata-sections -fno-tree-vrp -I/usr/local/include -Qunused-arguments -O2 -pipe -march=pentium4 -mtune=pentium4 -Wno-error -w -isystem/usr/local/include -I/usr/local/include -pthread -L/usr/local/lib -L/usr/local/lib -Wl,-z,origin -Wl,-rpath,\$$ORIGIN -Wl,-z,noexecstack conftest.c -L/usr/local/lib -lsqlite3 1>&5
configure:22145: checking for conic
configure:23375: checking for valid optimization flags
configure:23386: clang -c -O2 -pipe -march=pentium4 -mtune=pentium4 -fno-strict-aliasing -fno-strict-aliasing -ffunction-sections -fdata-sections -fno-tree-vrp -O2 -Qunused-arguments -O2 -pipe -march=pentium4 -mtune=pentium4 -Wno-error -w -isystem/usr/local/include -I/usr/local/include conftest.c 1>&5
configure:23844: checking size of int *
configure:23863: clang -o conftest -O2 -pipe -march=pentium4 -mtune=pentium4 -fno-strict-aliasing -fno-strict-aliasing -ffunction-sections -fdata-sections -fno-tree-vrp -Qunused-arguments -O2 -pipe -march=pentium4 -mtune=pentium4 -Wno-error -w -isystem/usr/local/include -I/usr/local/include -pthread -L/usr/local/lib -L/usr/local/lib -Wl,-z,origin -Wl,-rpath,\$$ORIGIN -Wl,-z,noexecstack conftest.c 1>&5
Stack dump:
0. Program arguments: /usr/bin/clang -cc1 -triple i386-unknown-freebsd9.0 -emit-obj -disable-free -main-file-name conftest.c -mrelocation-model static -mdisable-fp-elim -relaxed-aliasing -masm-verbose -mconstructor-aliases -target-cpu pentium4 -momit-leaf-frame-pointer -ffunction-sections -fdata-sections -resource-dir /usr/bin/../lib/clang/3.0 -isystem /usr/local/include -I /usr/local/include -fmodule-cache-path /tmp/clang-module-cache -O2 -Wno-error -w -ferror-limit 19 -fmessage-length 0 -pthread -fgnu-runtime -fobjc-runtime-has-arc -fobjc-runtime-has-weak -fobjc-fragile-abi -fdiagnostics-show-option -o /tmp/conftest-77qaJi.o -x c conftest.c
1. <eof> parser at end of file
2. configure:23854:1: LLVM IR generation of declaration 'main'
3. configure:23854:1: Generating code for declaration 'main'
4. configure:23855:1: LLVM IR generation of compound statement ('{}')
clang: error: unable to execute command: Illegal instruction: 4 (core dumped)
clang: error: clang frontend command failed due to signal 2 (use -v to see invocation)
clang: note: diagnostic msg: Please submit a bug report to http://llvm.org/bugs/ and include command line arguments and all diagnostic information.
clang: note: diagnostic msg: Preprocessed source(s) are located at:
clang: note: diagnostic msg: /tmp/conftest-PDiTwg.i
configure: failed program was:
#line 23852 "configure"
#include "confdefs.h"
#include <stdio.h>
main()
{
FILE *f=fopen("conftestval", "w");
if (!f) exit(1);
fprintf(f, "%d\n", sizeof(int *));
exit(0);
}
[-- Attachment #3 --]
This file contains any messages produced by compilers while
running configure, to aid debugging if configure makes a mistake.
configure:872: checking host system type
configure:893: checking target system type
configure:911: checking build system type
configure:991: checking for mawk
configure:991: checking for gawk
configure:1062: checking for /usr/local/bin/python2.7
configure:1313: checking for /usr/local/bin/perl
configure:2278: checking for gcc
configure:2391: checking whether the C compiler (clang -O2 -pipe -march=pentium4 -mtune=pentium4 -fno-strict-aliasing -L/usr/local/lib -L/usr/local/lib -Wl,-z,origin -Wl,-rpath,\$$ORIGIN) works
configure:2407: clang -o conftest -O2 -pipe -march=pentium4 -mtune=pentium4 -fno-strict-aliasing -O2 -pipe -march=pentium4 -mtune=pentium4 -Wno-error -w -isystem/usr/local/include -L/usr/local/lib -L/usr/local/lib -Wl,-z,origin -Wl,-rpath,\$$ORIGIN conftest.c 1>&5
configure:2433: checking whether the C compiler (clang -O2 -pipe -march=pentium4 -mtune=pentium4 -fno-strict-aliasing -L/usr/local/lib -L/usr/local/lib -Wl,-z,origin -Wl,-rpath,\$$ORIGIN) is a cross-compiler
configure:2438: checking whether we are using GNU C
configure:2447: clang -E conftest.c
configure:2466: checking whether clang accepts -g
configure:2507: checking for c++
configure:2539: checking whether the C++ compiler (clang++ -O2 -pipe -march=pentium4 -mtune=pentium4 -fno-strict-aliasing -O2 -pipe -march=pentium4 -mtune=pentium4 -Wno-error -w -L/usr/local/lib -L/usr/local/lib -Wl,-z,origin -Wl,-rpath,\$$ORIGIN) works
configure:2555: clang++ -o conftest -O2 -pipe -march=pentium4 -mtune=pentium4 -fno-strict-aliasing -O2 -pipe -march=pentium4 -mtune=pentium4 -Wno-error -w -O2 -pipe -march=pentium4 -mtune=pentium4 -Wno-error -w -isystem/usr/local/include -L/usr/local/lib -L/usr/local/lib -Wl,-z,origin -Wl,-rpath,\$$ORIGIN conftest.C 1>&5
configure:2581: checking whether the C++ compiler (clang++ -O2 -pipe -march=pentium4 -mtune=pentium4 -fno-strict-aliasing -O2 -pipe -march=pentium4 -mtune=pentium4 -Wno-error -w -L/usr/local/lib -L/usr/local/lib -Wl,-z,origin -Wl,-rpath,\$$ORIGIN) is a cross-compiler
configure:2586: checking whether we are using GNU C++
configure:2595: clang++ -E conftest.C
configure:2614: checking whether clang++ accepts -g
configure:2648: checking for ranlib
configure:2680: checking for as
configure:2734: checking for ar
configure:2769: checking for ld
configure:2804: checking for strip
configure:2839: checking for windres
configure:3670: checking whether clang and cc understand -c and -o together
configure:3685: clang -c conftest.c -o conftest.o 1>&5
conftest.c:1:1: warning: type specifier missing, defaults to 'int' [-Wimplicit-int]
foo(){}
^~~
conftest.c:1:7: warning: control reaches end of non-void function [-Wreturn-type]
foo(){}
^
2 warnings generated.
configure:3686: clang -c conftest.c -o conftest.o 1>&5
conftest.c:1:1: warning: type specifier missing, defaults to 'int' [-Wimplicit-int]
foo(){}
^~~
conftest.c:1:7: warning: control reaches end of non-void function [-Wreturn-type]
foo(){}
^
2 warnings generated.
configure:3691: cc -c conftest.c 1>&5
configure:3693: cc -c conftest.c -o conftest.o 1>&5
configure:3694: cc -c conftest.c -o conftest.o 1>&5
configure:3733: checking how to run the C preprocessor
configure:3813: checking how to run the C++ preprocessor
configure:3831: clang++ -E -O2 -pipe -march=pentium4 -mtune=pentium4 -Wno-error -w -isystem/usr/local/include conftest.C >/dev/null 2>conftest.out
configure:3902: checking for a BSD compatible install
configure:3955: checking whether ln -s works
configure:3978: checking for minimum required perl version >= 5.006
configure:3989: checking for full perl installation
configure:4026: checking for doxygen
configure:4075: checking for autoconf
configure:4124: checking for unzip
configure:4175: checking for zip
configure:4229: checking for xargs
configure:4514: checking for X
configure:4831: checking for dnet_ntoa in -ldnet
configure:4850: clang -o conftest -O2 -pipe -march=pentium4 -mtune=pentium4 -fno-strict-aliasing -O2 -pipe -march=pentium4 -mtune=pentium4 -Wno-error -w -isystem/usr/local/include -L/usr/local/lib -L/usr/local/lib -Wl,-z,origin -Wl,-rpath,\$$ORIGIN conftest.c -ldnet 1>&5
/usr/bin/ld: cannot find -ldnet
clang: error: linker command failed with exit code 1 (use -v to see invocation)
configure: failed program was:
#line 4839 "configure"
#include "confdefs.h"
/* Override any gcc2 internal prototype to avoid an error. */
/* We use char because int might match the return type of a gcc2
builtin and then its argument prototype would still apply. */
char dnet_ntoa();
int main() {
dnet_ntoa()
; return 0; }
configure:4872: checking for dnet_ntoa in -ldnet_stub
configure:4891: clang -o conftest -O2 -pipe -march=pentium4 -mtune=pentium4 -fno-strict-aliasing -O2 -pipe -march=pentium4 -mtune=pentium4 -Wno-error -w -isystem/usr/local/include -L/usr/local/lib -L/usr/local/lib -Wl,-z,origin -Wl,-rpath,\$$ORIGIN conftest.c -ldnet_stub 1>&5
/usr/bin/ld: cannot find -ldnet_stub
clang: error: linker command failed with exit code 1 (use -v to see invocation)
configure: failed program was:
#line 4880 "configure"
#include "confdefs.h"
/* Override any gcc2 internal prototype to avoid an error. */
/* We use char because int might match the return type of a gcc2
builtin and then its argument prototype would still apply. */
char dnet_ntoa();
int main() {
dnet_ntoa()
; return 0; }
configure:4920: checking for gethostbyname
configure:4948: clang -o conftest -O2 -pipe -march=pentium4 -mtune=pentium4 -fno-strict-aliasing -O2 -pipe -march=pentium4 -mtune=pentium4 -Wno-error -w -isystem/usr/local/include -L/usr/local/lib -L/usr/local/lib -Wl,-z,origin -Wl,-rpath,\$$ORIGIN conftest.c 1>&5
configure:5018: checking for connect
configure:5046: clang -o conftest -O2 -pipe -march=pentium4 -mtune=pentium4 -fno-strict-aliasing -O2 -pipe -march=pentium4 -mtune=pentium4 -Wno-error -w -isystem/usr/local/include -L/usr/local/lib -L/usr/local/lib -Wl,-z,origin -Wl,-rpath,\$$ORIGIN conftest.c 1>&5
configure:5110: checking for remove
configure:5138: clang -o conftest -O2 -pipe -march=pentium4 -mtune=pentium4 -fno-strict-aliasing -O2 -pipe -march=pentium4 -mtune=pentium4 -Wno-error -w -isystem/usr/local/include -L/usr/local/lib -L/usr/local/lib -Wl,-z,origin -Wl,-rpath,\$$ORIGIN conftest.c 1>&5
configure:5202: checking for shmat
configure:5230: clang -o conftest -O2 -pipe -march=pentium4 -mtune=pentium4 -fno-strict-aliasing -O2 -pipe -march=pentium4 -mtune=pentium4 -Wno-error -w -isystem/usr/local/include -L/usr/local/lib -L/usr/local/lib -Wl,-z,origin -Wl,-rpath,\$$ORIGIN conftest.c 1>&5
configure:5303: checking for IceConnectionNumber in -lICE
configure:5322: clang -o conftest -O2 -pipe -march=pentium4 -mtune=pentium4 -fno-strict-aliasing -O2 -pipe -march=pentium4 -mtune=pentium4 -Wno-error -w -isystem/usr/local/include -L/usr/local/lib -L/usr/local/lib -Wl,-z,origin -Wl,-rpath,\$$ORIGIN -L/usr/local/lib conftest.c -lICE 1>&5
configure:5623: checking whether the C compiler supports -Werror=return-type
configure:5646: clang -c -O2 -pipe -march=pentium4 -mtune=pentium4 -fno-strict-aliasing -fno-strict-aliasing -Werror -Werror=return-type -O2 -pipe -march=pentium4 -mtune=pentium4 -Wno-error -w -isystem/usr/local/include conftest.c 1>&5
configure:5674: checking whether the C compiler supports -Wtype-limits
configure:5697: clang -c -O2 -pipe -march=pentium4 -mtune=pentium4 -fno-strict-aliasing -fno-strict-aliasing -Werror -Wtype-limits -O2 -pipe -march=pentium4 -mtune=pentium4 -Wno-error -w -isystem/usr/local/include conftest.c 1>&5
configure:5725: checking whether the C compiler supports -Wempty-body
configure:5748: clang -c -O2 -pipe -march=pentium4 -mtune=pentium4 -fno-strict-aliasing -fno-strict-aliasing -Werror -Wempty-body -O2 -pipe -march=pentium4 -mtune=pentium4 -Wno-error -w -isystem/usr/local/include conftest.c 1>&5
configure:5782: checking whether the C compiler supports -Wno-overlength-strings
configure:5805: clang -c -O2 -pipe -march=pentium4 -mtune=pentium4 -fno-strict-aliasing -fno-strict-aliasing -Werror -Woverlength-strings -O2 -pipe -march=pentium4 -mtune=pentium4 -Wno-error -w -isystem/usr/local/include conftest.c 1>&5
configure:5890: checking whether the C++ compiler supports -Werror=return-type
configure:5913: clang++ -c -O2 -pipe -march=pentium4 -mtune=pentium4 -fno-strict-aliasing -O2 -pipe -march=pentium4 -mtune=pentium4 -Wno-error -w -fno-exceptions -fno-strict-aliasing -Werror -Werror=return-type -O2 -pipe -march=pentium4 -mtune=pentium4 -Wno-error -w -isystem/usr/local/include conftest.C 1>&5
configure:5941: checking whether the C++ compiler supports -Wtype-limits
configure:5964: clang++ -c -O2 -pipe -march=pentium4 -mtune=pentium4 -fno-strict-aliasing -O2 -pipe -march=pentium4 -mtune=pentium4 -Wno-error -w -fno-exceptions -fno-strict-aliasing -Werror -Wtype-limits -O2 -pipe -march=pentium4 -mtune=pentium4 -Wno-error -w -isystem/usr/local/include conftest.C 1>&5
configure:5992: checking whether the C++ compiler supports -Wempty-body
configure:6015: clang++ -c -O2 -pipe -march=pentium4 -mtune=pentium4 -fno-strict-aliasing -O2 -pipe -march=pentium4 -mtune=pentium4 -Wno-error -w -fno-exceptions -fno-strict-aliasing -Werror -Wempty-body -O2 -pipe -march=pentium4 -mtune=pentium4 -Wno-error -w -isystem/usr/local/include conftest.C 1>&5
configure:6043: checking whether the C++ compiler supports -Werror=conversion-null
configure:6066: clang++ -c -O2 -pipe -march=pentium4 -mtune=pentium4 -fno-strict-aliasing -O2 -pipe -march=pentium4 -mtune=pentium4 -Wno-error -w -fno-exceptions -fno-strict-aliasing -Werror -Werror=conversion-null -O2 -pipe -march=pentium4 -mtune=pentium4 -Wno-error -w -isystem/usr/local/include conftest.C 1>&5
configure:6102: checking whether the C++ compiler supports -Wno-overlength-strings
configure:6125: clang++ -c -O2 -pipe -march=pentium4 -mtune=pentium4 -fno-strict-aliasing -O2 -pipe -march=pentium4 -mtune=pentium4 -Wno-error -w -fno-exceptions -fno-strict-aliasing -Werror -Woverlength-strings -O2 -pipe -march=pentium4 -mtune=pentium4 -Wno-error -w -isystem/usr/local/include conftest.C 1>&5
configure:6153: checking whether the C++ compiler supports -Wno-invalid-offsetof
configure:6176: clang++ -c -O2 -pipe -march=pentium4 -mtune=pentium4 -fno-strict-aliasing -O2 -pipe -march=pentium4 -mtune=pentium4 -Wno-error -w -fno-exceptions -fno-strict-aliasing -Werror -Winvalid-offsetof -O2 -pipe -march=pentium4 -mtune=pentium4 -Wno-error -w -isystem/usr/local/include conftest.C 1>&5
configure:6204: checking whether the C++ compiler supports -Wno-variadic-macros
configure:6227: clang++ -c -O2 -pipe -march=pentium4 -mtune=pentium4 -fno-strict-aliasing -O2 -pipe -march=pentium4 -mtune=pentium4 -Wno-error -w -fno-exceptions -fno-strict-aliasing -Werror -Wvariadic-macros -O2 -pipe -march=pentium4 -mtune=pentium4 -Wno-error -w -isystem/usr/local/include conftest.C 1>&5
configure:6279: checking whether the C++ compiler supports -Wno-extended-offsetof
configure:6302: clang++ -c -O2 -pipe -march=pentium4 -mtune=pentium4 -fno-strict-aliasing -O2 -pipe -march=pentium4 -mtune=pentium4 -Wno-error -w -fno-exceptions -fno-strict-aliasing -Werror -Wextended-offsetof -O2 -pipe -march=pentium4 -mtune=pentium4 -Wno-error -w -isystem/usr/local/include conftest.C 1>&5
configure:6340: checking whether ld has archive extraction flags
configure:6364: clang -o conftest -O2 -pipe -march=pentium4 -mtune=pentium4 -fno-strict-aliasing -fno-strict-aliasing -O2 -pipe -march=pentium4 -mtune=pentium4 -Wno-error -w -isystem/usr/local/include -Wl,--whole-archive conftest.c -Wl,--no-whole-archive 1>&5
configure:6397: checking that static assertion macros used in autoconf tests work
configure:6418: clang -c -O2 -pipe -march=pentium4 -mtune=pentium4 -fno-strict-aliasing -fno-strict-aliasing -O2 -pipe -march=pentium4 -mtune=pentium4 -Wno-error -w -isystem/usr/local/include conftest.c 1>&5
configure:6435: clang -c -O2 -pipe -march=pentium4 -mtune=pentium4 -fno-strict-aliasing -fno-strict-aliasing -O2 -pipe -march=pentium4 -mtune=pentium4 -Wno-error -w -isystem/usr/local/include conftest.c 1>&5
configure:6435:1: error: 'static_assert_line_6435' declared as an array with a negative size
CONFIGURE_STATIC_ASSERT(0)
^~~~~~~~~~~~~~~~~~~~~~~~~~
configure:6430:44: note: expanded from:
#define CONFIGURE_STATIC_ASSERT(condition) CONFIGURE_STATIC_ASSERT_IMPL(condition, __LINE__)
^
configure:6431:55: note: expanded from:
#define CONFIGURE_STATIC_ASSERT_IMPL(condition, line) CONFIGURE_STATIC_ASSERT_IMPL2(condition, line)
^
configure:6432:94: note: expanded from:
#define CONFIGURE_STATIC_ASSERT_IMPL2(condition, line) typedef int static_assert_line_##line[(condition) ? 1 : -1]
^~~~~~~~~~~~~~~~~~~~
1 error generated.
configure: failed program was:
#line 6428 "configure"
#include "confdefs.h"
#define CONFIGURE_STATIC_ASSERT(condition) CONFIGURE_STATIC_ASSERT_IMPL(condition, __LINE__)
#define CONFIGURE_STATIC_ASSERT_IMPL(condition, line) CONFIGURE_STATIC_ASSERT_IMPL2(condition, line)
#define CONFIGURE_STATIC_ASSERT_IMPL2(condition, line) typedef int static_assert_line_##line[(condition) ? 1 : -1]
int main() {
CONFIGURE_STATIC_ASSERT(0)
; return 0; }
configure:6458: clang++ -c -O2 -pipe -march=pentium4 -mtune=pentium4 -fno-strict-aliasing -O2 -pipe -march=pentium4 -mtune=pentium4 -Wno-error -w -fno-exceptions -fno-strict-aliasing -O2 -pipe -march=pentium4 -mtune=pentium4 -Wno-error -w -isystem/usr/local/include conftest.C 1>&5
configure:6475: clang++ -c -O2 -pipe -march=pentium4 -mtune=pentium4 -fno-strict-aliasing -O2 -pipe -march=pentium4 -mtune=pentium4 -Wno-error -w -fno-exceptions -fno-strict-aliasing -O2 -pipe -march=pentium4 -mtune=pentium4 -Wno-error -w -isystem/usr/local/include conftest.C 1>&5
configure:6475:1: error: 'static_assert_line_6475' declared as an array with a negative size
CONFIGURE_STATIC_ASSERT(0)
^~~~~~~~~~~~~~~~~~~~~~~~~~
configure:6470:44: note: expanded from:
#define CONFIGURE_STATIC_ASSERT(condition) CONFIGURE_STATIC_ASSERT_IMPL(condition, __LINE__)
^
configure:6471:55: note: expanded from:
#define CONFIGURE_STATIC_ASSERT_IMPL(condition, line) CONFIGURE_STATIC_ASSERT_IMPL2(condition, line)
^
configure:6472:94: note: expanded from:
#define CONFIGURE_STATIC_ASSERT_IMPL2(condition, line) typedef int static_assert_line_##line[(condition) ? 1 : -1]
^~~~~~~~~~~~~~~~~~~~
1 error generated.
configure: failed program was:
#line 6468 "configure"
#include "confdefs.h"
#define CONFIGURE_STATIC_ASSERT(condition) CONFIGURE_STATIC_ASSERT_IMPL(condition, __LINE__)
#define CONFIGURE_STATIC_ASSERT_IMPL(condition, line) CONFIGURE_STATIC_ASSERT_IMPL2(condition, line)
#define CONFIGURE_STATIC_ASSERT_IMPL2(condition, line) typedef int static_assert_line_##line[(condition) ? 1 : -1]
int main() {
CONFIGURE_STATIC_ASSERT(0)
; return 0; }
configure:6509: checking for 64-bit OS
configure:6518: clang -c -O2 -pipe -march=pentium4 -mtune=pentium4 -fno-strict-aliasing -fno-strict-aliasing -O2 -pipe -march=pentium4 -mtune=pentium4 -Wno-error -w -isystem/usr/local/include conftest.c 1>&5
configure:6518:1: error: 'static_assert_line_6518' declared as an array with a negative size
CONFIGURE_STATIC_ASSERT(sizeof(void*) == 8)
^~~~~~~~~~~~~~~~~~~~~~~~~~~~~~~~~~~~~~~~~~~
configure:6513:44: note: expanded from:
#define CONFIGURE_STATIC_ASSERT(condition) CONFIGURE_STATIC_ASSERT_IMPL(condition, __LINE__)
^
configure:6514:55: note: expanded from:
#define CONFIGURE_STATIC_ASSERT_IMPL(condition, line) CONFIGURE_STATIC_ASSERT_IMPL2(condition, line)
^
configure:6515:94: note: expanded from:
#define CONFIGURE_STATIC_ASSERT_IMPL2(condition, line) typedef int static_assert_line_##line[(condition) ? 1 : -1]
^~~~~~~~~~~~~~~~~~~~
1 error generated.
configure: failed program was:
#line 6511 "configure"
#include "confdefs.h"
#define CONFIGURE_STATIC_ASSERT(condition) CONFIGURE_STATIC_ASSERT_IMPL(condition, __LINE__)
#define CONFIGURE_STATIC_ASSERT_IMPL(condition, line) CONFIGURE_STATIC_ASSERT_IMPL2(condition, line)
#define CONFIGURE_STATIC_ASSERT_IMPL2(condition, line) typedef int static_assert_line_##line[(condition) ? 1 : -1]
int main() {
CONFIGURE_STATIC_ASSERT(sizeof(void*) == 8)
; return 0; }
configure:6639: checking for custom <stdint.h> implementation
configure:7847: checking whether the linker supports Identical Code Folding
configure:7856: clang -o conftest -L/usr/local/lib -L/usr/local/lib -Wl,-z,origin -Wl,-rpath,\$$ORIGIN -Wl,--icf=safe -ffunction-sections conftest.c 1>&2
/usr/bin/ld: unrecognized option '--icf=safe'
/usr/bin/ld: use the --help option for usage information
clang: error: linker command failed with exit code 1 (use -v to see invocation)
configure:7927: checking for ANSI C header files
configure:7940: clang-cpp -O2 -pipe -march=pentium4 -mtune=pentium4 -Wno-error -w -isystem/usr/local/include conftest.c >/dev/null 2>conftest.out
configure:8007: clang -o conftest -O2 -pipe -march=pentium4 -mtune=pentium4 -fno-strict-aliasing -fno-strict-aliasing -ffunction-sections -fdata-sections -O2 -pipe -march=pentium4 -mtune=pentium4 -Wno-error -w -isystem/usr/local/include -L/usr/local/lib -L/usr/local/lib -Wl,-z,origin -Wl,-rpath,\$$ORIGIN conftest.c 1>&5
configure:8034: checking for working const
configure:8088: clang -c -O2 -pipe -march=pentium4 -mtune=pentium4 -fno-strict-aliasing -fno-strict-aliasing -ffunction-sections -fdata-sections -O2 -pipe -march=pentium4 -mtune=pentium4 -Wno-error -w -isystem/usr/local/include conftest.c 1>&5
configure:8112: checking for mode_t
configure:8148: checking for off_t
configure:8184: checking for pid_t
configure:8220: checking for size_t
configure:8263: checking for __stdcall
configure:8277: clang++ -c -O2 -pipe -march=pentium4 -mtune=pentium4 -fno-strict-aliasing -O2 -pipe -march=pentium4 -mtune=pentium4 -Wno-error -w -fno-exceptions -fno-strict-aliasing -fno-rtti -ffunction-sections -fdata-sections -fno-exceptions -O2 -pipe -march=pentium4 -mtune=pentium4 -Wno-error -w -isystem/usr/local/include conftest.C 1>&5
configure:8309: checking for ssize_t
configure:8322: clang -c -O2 -pipe -march=pentium4 -mtune=pentium4 -fno-strict-aliasing -fno-strict-aliasing -ffunction-sections -fdata-sections -O2 -pipe -march=pentium4 -mtune=pentium4 -Wno-error -w -isystem/usr/local/include conftest.c 1>&5
configure:8347: checking for st_blksize in struct stat
configure:8360: clang -c -O2 -pipe -march=pentium4 -mtune=pentium4 -fno-strict-aliasing -fno-strict-aliasing -ffunction-sections -fdata-sections -O2 -pipe -march=pentium4 -mtune=pentium4 -Wno-error -w -isystem/usr/local/include conftest.c 1>&5
configure:8384: checking for siginfo_t
configure:8397: clang -c -O2 -pipe -march=pentium4 -mtune=pentium4 -fno-strict-aliasing -fno-strict-aliasing -ffunction-sections -fdata-sections -O2 -pipe -march=pentium4 -mtune=pentium4 -Wno-error -w -isystem/usr/local/include conftest.c 1>&5
Stack dump:
0. Program arguments: /usr/bin/clang -cc1 -triple i386-unknown-freebsd9.0 -emit-obj -disable-free -main-file-name conftest.c -mrelocation-model static -mdisable-fp-elim -relaxed-aliasing -masm-verbose -mconstructor-aliases -target-cpu pentium4 -momit-leaf-frame-pointer -ffunction-sections -fdata-sections -coverage-file conftest.o -resource-dir /usr/bin/../lib/clang/3.0 -isystem /usr/local/include -fmodule-cache-path /tmp/clang-module-cache -O2 -Wno-error -w -ferror-limit 19 -fmessage-length 0 -fgnu-runtime -fobjc-runtime-has-arc -fobjc-runtime-has-weak -fobjc-fragile-abi -fdiagnostics-show-option -o conftest.o -x c conftest.c
1. <eof> parser at end of file
2. configure:8392:5: LLVM IR generation of declaration 'main'
3. configure:8392:5: Generating code for declaration 'main'
4. configure:8392:12: LLVM IR generation of compound statement ('{}')
clang: error: unable to execute command: Illegal instruction: 4 (core dumped)
clang: error: clang frontend command failed due to signal 2 (use -v to see invocation)
clang: note: diagnostic msg: Please submit a bug report to http://llvm.org/bugs/ and include command line arguments and all diagnostic information.
clang: note: diagnostic msg: Preprocessed source(s) are located at:
clang: note: diagnostic msg: /tmp/conftest-XTdLlw.i
configure: failed program was:
#line 8389 "configure"
#include "confdefs.h"
#define _POSIX_C_SOURCE 199506L
#include <signal.h>
int main() {
siginfo_t* info;
; return 0; }
configure:8423: checking for int64
configure:8436: clang -c -O2 -pipe -march=pentium4 -mtune=pentium4 -fno-strict-aliasing -fno-strict-aliasing -ffunction-sections -fdata-sections -O2 -pipe -march=pentium4 -mtune=pentium4 -Wno-error -w -isystem/usr/local/include conftest.c 1>&5
configure:8432:1: error: use of undeclared identifier 'int64'
int64 foo = 0;
^
1 error generated.
configure: failed program was:
#line 8428 "configure"
#include "confdefs.h"
#include <stdio.h>
#include <sys/types.h>
int main() {
int64 foo = 0;
; return 0; }
configure:8461: checking for uint
configure:8474: clang -c -O2 -pipe -march=pentium4 -mtune=pentium4 -fno-strict-aliasing -fno-strict-aliasing -ffunction-sections -fdata-sections -O2 -pipe -march=pentium4 -mtune=pentium4 -Wno-error -w -isystem/usr/local/include conftest.c 1>&5
configure:8499: checking for uint_t
configure:8512: clang -c -O2 -pipe -march=pentium4 -mtune=pentium4 -fno-strict-aliasing -fno-strict-aliasing -ffunction-sections -fdata-sections -O2 -pipe -march=pentium4 -mtune=pentium4 -Wno-error -w -isystem/usr/local/include conftest.c 1>&5
configure:8508:1: error: unknown type name 'uint_t'; did you mean 'uint8_t'?
uint_t foo = 0;
^~~~~~
uint8_t
/usr/include/sys/_stdint.h:54:20: note: 'uint8_t' declared here
typedef __uint8_t uint8_t;
^
1 error generated.
configure: failed program was:
#line 8504 "configure"
#include "confdefs.h"
#include <stdio.h>
#include <sys/types.h>
int main() {
uint_t foo = 0;
; return 0; }
configure:8546: checking for uname.domainname
configure:8559: clang++ -c -O2 -pipe -march=pentium4 -mtune=pentium4 -fno-strict-aliasing -O2 -pipe -march=pentium4 -mtune=pentium4 -Wno-error -w -fno-exceptions -fno-strict-aliasing -fno-rtti -ffunction-sections -fdata-sections -fno-exceptions -O2 -pipe -march=pentium4 -mtune=pentium4 -Wno-error -w -isystem/usr/local/include conftest.C 1>&5
configure:8555:62: error: no member named 'domainname' in 'utsname'
(void)uname(res); if (res != 0) { domain = res->domainname; }
~~~ ^
1 error generated.
configure: failed program was:
#line 8551 "configure"
#include "confdefs.h"
#include <sys/utsname.h>
int main() {
struct utsname *res; char *domain;
(void)uname(res); if (res != 0) { domain = res->domainname; }
; return 0; }
configure:8586: checking for uname.__domainname
configure:8599: clang++ -c -O2 -pipe -march=pentium4 -mtune=pentium4 -fno-strict-aliasing -O2 -pipe -march=pentium4 -mtune=pentium4 -Wno-error -w -fno-exceptions -fno-strict-aliasing -fno-rtti -ffunction-sections -fdata-sections -fno-exceptions -O2 -pipe -march=pentium4 -mtune=pentium4 -Wno-error -w -isystem/usr/local/include conftest.C 1>&5
configure:8595:62: error: no member named '__domainname' in 'utsname'
(void)uname(res); if (res != 0) { domain = res->__domainname; }
~~~ ^
1 error generated.
configure: failed program was:
#line 8591 "configure"
#include "confdefs.h"
#include <sys/utsname.h>
int main() {
struct utsname *res; char *domain;
(void)uname(res); if (res != 0) { domain = res->__domainname; }
; return 0; }
configure:8639: checking for gcc c++0x headers bug without rtti
configure:8651: clang++ -c -O2 -pipe -march=pentium4 -mtune=pentium4 -fno-strict-aliasing -O2 -pipe -march=pentium4 -mtune=pentium4 -Wno-error -w -fno-exceptions -fno-strict-aliasing -fno-rtti -ffunction-sections -fdata-sections -fno-exceptions -std=gnu++0x -O2 -pipe -march=pentium4 -mtune=pentium4 -Wno-error -w -isystem/usr/local/include conftest.C 1>&5
configure:8671: checking for usable char16_t (2 bytes, unsigned)
configure:8687: clang++ -c -O2 -pipe -march=pentium4 -mtune=pentium4 -fno-strict-aliasing -O2 -pipe -march=pentium4 -mtune=pentium4 -Wno-error -w -fno-exceptions -fno-strict-aliasing -fno-rtti -ffunction-sections -fdata-sections -fno-exceptions -std=gnu++0x -O2 -pipe -march=pentium4 -mtune=pentium4 -Wno-error -w -isystem/usr/local/include conftest.C 1>&5
configure:8717: checking for usable wchar_t (2 bytes, unsigned)
configure:8731: clang++ -c -O2 -pipe -march=pentium4 -mtune=pentium4 -fno-strict-aliasing -O2 -pipe -march=pentium4 -mtune=pentium4 -Wno-error -w -fno-exceptions -fno-strict-aliasing -fno-rtti -ffunction-sections -fdata-sections -fno-exceptions -std=gnu++0x -O2 -pipe -march=pentium4 -mtune=pentium4 -Wno-error -w -isystem/usr/local/include conftest.C 1>&5
configure:8730:1: error: 'static_assert_line_8730' declared as an array with a negative size
CONFIGURE_STATIC_ASSERT(sizeof(wchar_t) == 2);
^~~~~~~~~~~~~~~~~~~~~~~~~~~~~~~~~~~~~~~~~~~~~
configure:8725:44: note: expanded from:
#define CONFIGURE_STATIC_ASSERT(condition) CONFIGURE_STATIC_ASSERT_IMPL(condition, __LINE__)
^
configure:8726:55: note: expanded from:
#define CONFIGURE_STATIC_ASSERT_IMPL(condition, line) CONFIGURE_STATIC_ASSERT_IMPL2(condition, line)
^
configure:8727:94: note: expanded from:
#define CONFIGURE_STATIC_ASSERT_IMPL2(condition, line) typedef int static_assert_line_##line[(condition) ? 1 : -1]
^~~~~~~~~~~~~~~~~~~~
configure:8731:22: error: 'static_assert_line_8731' declared as an array with a negative size
CONFIGURE_STATIC_ASSERT((wchar_t)-1 > (wchar_t) 0)
^~~~~~~~~~~~~~~~~~~~~~~~~~~~~~~~~~~~~~~~~~~~~~~~~~
configure:8725:44: note: expanded from:
#define CONFIGURE_STATIC_ASSERT(condition) CONFIGURE_STATIC_ASSERT_IMPL(condition, __LINE__)
^
configure:8726:55: note: expanded from:
#define CONFIGURE_STATIC_ASSERT_IMPL(condition, line) CONFIGURE_STATIC_ASSERT_IMPL2(condition, line)
^
configure:8727:94: note: expanded from:
#define CONFIGURE_STATIC_ASSERT_IMPL2(condition, line) typedef int static_assert_line_##line[(condition) ? 1 : -1]
^~~~~~~~~~~~~~~~~~~~
2 errors generated.
configure: failed program was:
#line 8722 "configure"
#include "confdefs.h"
#include <stddef.h>
#define CONFIGURE_STATIC_ASSERT(condition) CONFIGURE_STATIC_ASSERT_IMPL(condition, __LINE__)
#define CONFIGURE_STATIC_ASSERT_IMPL(condition, line) CONFIGURE_STATIC_ASSERT_IMPL2(condition, line)
#define CONFIGURE_STATIC_ASSERT_IMPL2(condition, line) typedef int static_assert_line_##line[(condition) ? 1 : -1]
int main() {
CONFIGURE_STATIC_ASSERT(sizeof(wchar_t) == 2);
CONFIGURE_STATIC_ASSERT((wchar_t)-1 > (wchar_t) 0)
; return 0; }
configure:8811: checking for visibility(hidden) attribute
configure:8839: checking for visibility(default) attribute
configure:8867: checking for visibility pragma support
configure:8892: checking For gcc visibility bug with class-level attributes (GCC bug 26905)
configure:8920: checking For x86_64 gcc visibility bug with builtins (GCC bug 20297)
configure:9027: checking whether the linker supports Identical Code Folding
configure:9111: checking for dirent.h that defines DIR
configure:9124: clang -c -O2 -pipe -march=pentium4 -mtune=pentium4 -fno-strict-aliasing -fno-strict-aliasing -ffunction-sections -fdata-sections -ffunction-sections -fdata-sections -O2 -pipe -march=pentium4 -mtune=pentium4 -Wno-error -w -isystem/usr/local/include conftest.c 1>&5
configure:9152: checking for opendir in -ldir
configure:9171: clang -o conftest -O2 -pipe -march=pentium4 -mtune=pentium4 -fno-strict-aliasing -fno-strict-aliasing -ffunction-sections -fdata-sections -ffunction-sections -fdata-sections -O2 -pipe -march=pentium4 -mtune=pentium4 -Wno-error -w -isystem/usr/local/include -L/usr/local/lib -L/usr/local/lib -Wl,-z,origin -Wl,-rpath,\$$ORIGIN conftest.c -ldir 1>&5
/usr/bin/ld: cannot find -ldir
clang: error: linker command failed with exit code 1 (use -v to see invocation)
configure: failed program was:
#line 9160 "configure"
#include "confdefs.h"
/* Override any gcc2 internal prototype to avoid an error. */
/* We use char because int might match the return type of a gcc2
builtin and then its argument prototype would still apply. */
char opendir();
int main() {
opendir()
; return 0; }
configure:9244: checking for sys/byteorder.h
configure:9254: clang-cpp -O2 -pipe -march=pentium4 -mtune=pentium4 -Wno-error -w -isystem/usr/local/include -I/usr/local/include conftest.c >/dev/null 2>conftest.out
configure:9250:10: fatal error: 'sys/byteorder.h' file not found
#include <sys/byteorder.h>
^
1 error generated.
configure: failed program was:
#line 9249 "configure"
#include "confdefs.h"
#include <sys/byteorder.h>
configure:9244: checking for compat.h
configure:9254: clang-cpp -O2 -pipe -march=pentium4 -mtune=pentium4 -Wno-error -w -isystem/usr/local/include -I/usr/local/include conftest.c >/dev/null 2>conftest.out
configure:9250:10: fatal error: 'compat.h' file not found
#include <compat.h>
^
1 error generated.
configure: failed program was:
#line 9249 "configure"
#include "confdefs.h"
#include <compat.h>
configure:9244: checking for getopt.h
configure:9254: clang-cpp -O2 -pipe -march=pentium4 -mtune=pentium4 -Wno-error -w -isystem/usr/local/include -I/usr/local/include conftest.c >/dev/null 2>conftest.out
configure:9287: checking for sys/bitypes.h
configure:9297: clang-cpp -O2 -pipe -march=pentium4 -mtune=pentium4 -Wno-error -w -isystem/usr/local/include -I/usr/local/include conftest.c >/dev/null 2>conftest.out
configure:9293:10: fatal error: 'sys/bitypes.h' file not found
#include <sys/bitypes.h>
^
1 error generated.
configure: failed program was:
#line 9292 "configure"
#include "confdefs.h"
#include <sys/bitypes.h>
configure:9287: checking for memory.h
configure:9297: clang-cpp -O2 -pipe -march=pentium4 -mtune=pentium4 -Wno-error -w -isystem/usr/local/include -I/usr/local/include conftest.c >/dev/null 2>conftest.out
configure:9287: checking for unistd.h
configure:9297: clang-cpp -O2 -pipe -march=pentium4 -mtune=pentium4 -Wno-error -w -isystem/usr/local/include -I/usr/local/include conftest.c >/dev/null 2>conftest.out
configure:9330: checking for gnu/libc-version.h
configure:9340: clang-cpp -O2 -pipe -march=pentium4 -mtune=pentium4 -Wno-error -w -isystem/usr/local/include -I/usr/local/include conftest.c >/dev/null 2>conftest.out
configure:9336:10: fatal error: 'gnu/libc-version.h' file not found
#include <gnu/libc-version.h>
^
1 error generated.
configure: failed program was:
#line 9335 "configure"
#include "confdefs.h"
#include <gnu/libc-version.h>
configure:9330: checking for nl_types.h
configure:9340: clang-cpp -O2 -pipe -march=pentium4 -mtune=pentium4 -Wno-error -w -isystem/usr/local/include -I/usr/local/include conftest.c >/dev/null 2>conftest.out
configure:9373: checking for malloc.h
configure:9383: clang-cpp -O2 -pipe -march=pentium4 -mtune=pentium4 -Wno-error -w -isystem/usr/local/include -I/usr/local/include conftest.c >/dev/null 2>conftest.out
In file included from configure:9379:
/usr/include/malloc.h:3:2: error: #error "<malloc.h> has been replaced by <stdlib.h>"
#error "<malloc.h> has been replaced by <stdlib.h>"
^
1 error generated.
configure: failed program was:
#line 9378 "configure"
#include "confdefs.h"
#include <malloc.h>
configure:9416: checking for X11/XKBlib.h
configure:9426: clang-cpp -O2 -pipe -march=pentium4 -mtune=pentium4 -Wno-error -w -isystem/usr/local/include -I/usr/local/include conftest.c >/dev/null 2>conftest.out
configure:9460: checking for sys/statvfs.h
configure:9470: clang-cpp -O2 -pipe -march=pentium4 -mtune=pentium4 -Wno-error -w -isystem/usr/local/include -I/usr/local/include conftest.c >/dev/null 2>conftest.out
configure:9460: checking for sys/statfs.h
configure:9470: clang-cpp -O2 -pipe -march=pentium4 -mtune=pentium4 -Wno-error -w -isystem/usr/local/include -I/usr/local/include conftest.c >/dev/null 2>conftest.out
configure:9466:10: fatal error: 'sys/statfs.h' file not found
#include <sys/statfs.h>
^
1 error generated.
configure: failed program was:
#line 9465 "configure"
#include "confdefs.h"
#include <sys/statfs.h>
configure:9460: checking for sys/vfs.h
configure:9470: clang-cpp -O2 -pipe -march=pentium4 -mtune=pentium4 -Wno-error -w -isystem/usr/local/include -I/usr/local/include conftest.c >/dev/null 2>conftest.out
configure:9466:10: fatal error: 'sys/vfs.h' file not found
#include <sys/vfs.h>
^
1 error generated.
configure: failed program was:
#line 9465 "configure"
#include "confdefs.h"
#include <sys/vfs.h>
configure:9460: checking for sys/mount.h
configure:9470: clang-cpp -O2 -pipe -march=pentium4 -mtune=pentium4 -Wno-error -w -isystem/usr/local/include -I/usr/local/include conftest.c >/dev/null 2>conftest.out
configure:9510: checking for new
configure:9520: clang++ -E -O2 -pipe -march=pentium4 -mtune=pentium4 -Wno-error -w -isystem/usr/local/include -I/usr/local/include conftest.C >/dev/null 2>conftest.out
configure:9618: checking for sys/cdefs.h
configure:9628: clang-cpp -O2 -pipe -march=pentium4 -mtune=pentium4 -Wno-error -w -isystem/usr/local/include -I/usr/local/include conftest.c >/dev/null 2>conftest.out
configure:9665: checking for gethostbyname_r in -lc_r
configure:9684: clang -o conftest -O2 -pipe -march=pentium4 -mtune=pentium4 -fno-strict-aliasing -fno-strict-aliasing -ffunction-sections -fdata-sections -ffunction-sections -fdata-sections -O2 -pipe -march=pentium4 -mtune=pentium4 -Wno-error -w -isystem/usr/local/include -I/usr/local/include -L/usr/local/lib -L/usr/local/lib -Wl,-z,origin -Wl,-rpath,\$$ORIGIN conftest.c -lc_r 1>&5
/usr/bin/ld: cannot find -lc_r
clang: error: linker command failed with exit code 1 (use -v to see invocation)
configure: failed program was:
#line 9673 "configure"
#include "confdefs.h"
/* Override any gcc2 internal prototype to avoid an error. */
/* We use char because int might match the return type of a gcc2
builtin and then its argument prototype would still apply. */
char gethostbyname_r();
int main() {
gethostbyname_r()
; return 0; }
configure:9724: checking for atan in -lm
configure:9743: clang -o conftest -O2 -pipe -march=pentium4 -mtune=pentium4 -fno-strict-aliasing -fno-strict-aliasing -ffunction-sections -fdata-sections -ffunction-sections -fdata-sections -O2 -pipe -march=pentium4 -mtune=pentium4 -Wno-error -w -isystem/usr/local/include -I/usr/local/include -L/usr/local/lib -L/usr/local/lib -Wl,-z,origin -Wl,-rpath,\$$ORIGIN conftest.c -lm 1>&5
configure:9774: checking for dlopen in -ldl
configure:9793: clang -o conftest -O2 -pipe -march=pentium4 -mtune=pentium4 -fno-strict-aliasing -fno-strict-aliasing -ffunction-sections -fdata-sections -ffunction-sections -fdata-sections -O2 -pipe -march=pentium4 -mtune=pentium4 -Wno-error -w -isystem/usr/local/include -I/usr/local/include -L/usr/local/lib -L/usr/local/lib -Wl,-z,origin -Wl,-rpath,\$$ORIGIN conftest.c -ldl -lm 1>&5
/usr/bin/ld: cannot find -ldl
clang: error: linker command failed with exit code 1 (use -v to see invocation)
configure: failed program was:
#line 9782 "configure"
#include "confdefs.h"
/* Override any gcc2 internal prototype to avoid an error. */
/* We use char because int might match the return type of a gcc2
builtin and then its argument prototype would still apply. */
char dlopen();
int main() {
dlopen()
; return 0; }
configure:9854: checking for dladdr
configure:9882: clang -o conftest -O2 -pipe -march=pentium4 -mtune=pentium4 -fno-strict-aliasing -fno-strict-aliasing -ffunction-sections -fdata-sections -ffunction-sections -fdata-sections -D_GNU_SOURCE -O2 -pipe -march=pentium4 -mtune=pentium4 -Wno-error -w -isystem/usr/local/include -I/usr/local/include -L/usr/local/lib -L/usr/local/lib -Wl,-z,origin -Wl,-rpath,\$$ORIGIN conftest.c -lm 1>&5
configure:10026: checking for socket in -lsocket
configure:10045: clang -o conftest -O2 -pipe -march=pentium4 -mtune=pentium4 -fno-strict-aliasing -fno-strict-aliasing -ffunction-sections -fdata-sections -ffunction-sections -fdata-sections -O2 -pipe -march=pentium4 -mtune=pentium4 -Wno-error -w -isystem/usr/local/include -I/usr/local/include -L/usr/local/lib -L/usr/local/lib -Wl,-z,origin -Wl,-rpath,\$$ORIGIN conftest.c -lsocket -lm 1>&5
/usr/bin/ld: cannot find -lsocket
clang: error: linker command failed with exit code 1 (use -v to see invocation)
configure: failed program was:
#line 10034 "configure"
#include "confdefs.h"
/* Override any gcc2 internal prototype to avoid an error. */
/* We use char because int might match the return type of a gcc2
builtin and then its argument prototype would still apply. */
char socket();
int main() {
socket()
; return 0; }
configure:10100: checking for XDrawLines in -lX11
configure:10119: clang -o conftest -O2 -pipe -march=pentium4 -mtune=pentium4 -fno-strict-aliasing -fno-strict-aliasing -ffunction-sections -fdata-sections -ffunction-sections -fdata-sections -O2 -pipe -march=pentium4 -mtune=pentium4 -Wno-error -w -isystem/usr/local/include -I/usr/local/include -L/usr/local/lib -L/usr/local/lib -L/usr/local/lib -Wl,-z,origin -Wl,-rpath,\$$ORIGIN conftest.c -lX11 -lX11 -lm 1>&5
configure:10140: checking for XextAddDisplay in -lXext
configure:10159: clang -o conftest -O2 -pipe -march=pentium4 -mtune=pentium4 -fno-strict-aliasing -fno-strict-aliasing -ffunction-sections -fdata-sections -ffunction-sections -fdata-sections -O2 -pipe -march=pentium4 -mtune=pentium4 -Wno-error -w -isystem/usr/local/include -I/usr/local/include -L/usr/local/lib -L/usr/local/lib -L/usr/local/lib -Wl,-z,origin -Wl,-rpath,\$$ORIGIN conftest.c -lXext -lX11 -lm 1>&5
configure:10182: checking for XtFree in -lXt
configure:10201: clang -o conftest -O2 -pipe -march=pentium4 -mtune=pentium4 -fno-strict-aliasing -fno-strict-aliasing -ffunction-sections -fdata-sections -ffunction-sections -fdata-sections -O2 -pipe -march=pentium4 -mtune=pentium4 -Wno-error -w -isystem/usr/local/include -I/usr/local/include -L/usr/local/lib -L/usr/local/lib -L/usr/local/lib -Wl,-z,origin -Wl,-rpath,\$$ORIGIN conftest.c -lXt -lm 1>&5
configure:10368: checking for pthread_create in -lpthreads
clang -o dummy dummy.c -O2 -pipe -march=pentium4 -mtune=pentium4 -fno-strict-aliasing -fno-strict-aliasing -ffunction-sections -fdata-sections -ffunction-sections -fdata-sections -O2 -pipe -march=pentium4 -mtune=pentium4 -Wno-error -w -isystem/usr/local/include -I/usr/local/include -lpthreads -L/usr/local/lib -L/usr/local/lib -Wl,-z,origin -Wl,-rpath,\$$ORIGIN -lm
/usr/bin/ld: cannot find -lpthreads
clang: error: linker command failed with exit code 1 (use -v to see invocation)
configure:10391: checking for pthread_create in -lpthread
clang -o dummy dummy.c -O2 -pipe -march=pentium4 -mtune=pentium4 -fno-strict-aliasing -fno-strict-aliasing -ffunction-sections -fdata-sections -ffunction-sections -fdata-sections -O2 -pipe -march=pentium4 -mtune=pentium4 -Wno-error -w -isystem/usr/local/include -I/usr/local/include -lpthread -L/usr/local/lib -L/usr/local/lib -Wl,-z,origin -Wl,-rpath,\$$ORIGIN -lm
configure:10496: checking whether clang accepts -pthread
configure:10624: checking whether mmap() sees write()s
configure:10667: clang -o conftest -O2 -pipe -march=pentium4 -mtune=pentium4 -fno-strict-aliasing -fno-strict-aliasing -ffunction-sections -fdata-sections -ffunction-sections -fdata-sections -O2 -pipe -march=pentium4 -mtune=pentium4 -Wno-error -w -isystem/usr/local/include -I/usr/local/include -pthread -L/usr/local/lib -L/usr/local/lib -Wl,-z,origin -Wl,-rpath,\$$ORIGIN conftest.c -lm 1>&5
configure:10695: checking whether clang needs -traditional
configure:10702:10: fatal error: 'sgtty.h' file not found
#include <sgtty.h>
^
1 error generated.
configure:10720:10: fatal error: 'termio.h' file not found
#include <termio.h>
^
1 error generated.
configure:10741: checking for 8-bit clean memcmp
configure:10759: clang -o conftest -O2 -pipe -march=pentium4 -mtune=pentium4 -fno-strict-aliasing -fno-strict-aliasing -ffunction-sections -fdata-sections -ffunction-sections -fdata-sections -O2 -pipe -march=pentium4 -mtune=pentium4 -Wno-error -w -isystem/usr/local/include -I/usr/local/include -pthread -L/usr/local/lib -L/usr/local/lib -Wl,-z,origin -Wl,-rpath,\$$ORIGIN conftest.c -lm 1>&5
configure:10779: checking for random
configure:10807: clang -o conftest -O2 -pipe -march=pentium4 -mtune=pentium4 -fno-strict-aliasing -fno-strict-aliasing -ffunction-sections -fdata-sections -ffunction-sections -fdata-sections -O2 -pipe -march=pentium4 -mtune=pentium4 -Wno-error -w -isystem/usr/local/include -I/usr/local/include -pthread -L/usr/local/lib -L/usr/local/lib -Wl,-z,origin -Wl,-rpath,\$$ORIGIN conftest.c -lm 1>&5
configure:10779: checking for strerror
configure:10807: clang -o conftest -O2 -pipe -march=pentium4 -mtune=pentium4 -fno-strict-aliasing -fno-strict-aliasing -ffunction-sections -fdata-sections -ffunction-sections -fdata-sections -O2 -pipe -march=pentium4 -mtune=pentium4 -Wno-error -w -isystem/usr/local/include -I/usr/local/include -pthread -L/usr/local/lib -L/usr/local/lib -Wl,-z,origin -Wl,-rpath,\$$ORIGIN conftest.c -lm 1>&5
configure:10779: checking for lchown
configure:10807: clang -o conftest -O2 -pipe -march=pentium4 -mtune=pentium4 -fno-strict-aliasing -fno-strict-aliasing -ffunction-sections -fdata-sections -ffunction-sections -fdata-sections -O2 -pipe -march=pentium4 -mtune=pentium4 -Wno-error -w -isystem/usr/local/include -I/usr/local/include -pthread -L/usr/local/lib -L/usr/local/lib -Wl,-z,origin -Wl,-rpath,\$$ORIGIN conftest.c -lm 1>&5
configure:10779: checking for fchmod
configure:10807: clang -o conftest -O2 -pipe -march=pentium4 -mtune=pentium4 -fno-strict-aliasing -fno-strict-aliasing -ffunction-sections -fdata-sections -ffunction-sections -fdata-sections -O2 -pipe -march=pentium4 -mtune=pentium4 -Wno-error -w -isystem/usr/local/include -I/usr/local/include -pthread -L/usr/local/lib -L/usr/local/lib -Wl,-z,origin -Wl,-rpath,\$$ORIGIN conftest.c -lm 1>&5
configure:10779: checking for snprintf
configure:10807: clang -o conftest -O2 -pipe -march=pentium4 -mtune=pentium4 -fno-strict-aliasing -fno-strict-aliasing -ffunction-sections -fdata-sections -ffunction-sections -fdata-sections -O2 -pipe -march=pentium4 -mtune=pentium4 -Wno-error -w -isystem/usr/local/include -I/usr/local/include -pthread -L/usr/local/lib -L/usr/local/lib -Wl,-z,origin -Wl,-rpath,\$$ORIGIN conftest.c -lm 1>&5
configure:10779: checking for statvfs
configure:10807: clang -o conftest -O2 -pipe -march=pentium4 -mtune=pentium4 -fno-strict-aliasing -fno-strict-aliasing -ffunction-sections -fdata-sections -ffunction-sections -fdata-sections -O2 -pipe -march=pentium4 -mtune=pentium4 -Wno-error -w -isystem/usr/local/include -I/usr/local/include -pthread -L/usr/local/lib -L/usr/local/lib -Wl,-z,origin -Wl,-rpath,\$$ORIGIN conftest.c -lm 1>&5
configure:10779: checking for memmove
configure:10807: clang -o conftest -O2 -pipe -march=pentium4 -mtune=pentium4 -fno-strict-aliasing -fno-strict-aliasing -ffunction-sections -fdata-sections -ffunction-sections -fdata-sections -O2 -pipe -march=pentium4 -mtune=pentium4 -Wno-error -w -isystem/usr/local/include -I/usr/local/include -pthread -L/usr/local/lib -L/usr/local/lib -Wl,-z,origin -Wl,-rpath,\$$ORIGIN conftest.c -lm 1>&5
configure:10779: checking for rint
configure:10807: clang -o conftest -O2 -pipe -march=pentium4 -mtune=pentium4 -fno-strict-aliasing -fno-strict-aliasing -ffunction-sections -fdata-sections -ffunction-sections -fdata-sections -O2 -pipe -march=pentium4 -mtune=pentium4 -Wno-error -w -isystem/usr/local/include -I/usr/local/include -pthread -L/usr/local/lib -L/usr/local/lib -Wl,-z,origin -Wl,-rpath,\$$ORIGIN conftest.c -lm 1>&5
configure:10779: checking for stat64
configure:10807: clang -o conftest -O2 -pipe -march=pentium4 -mtune=pentium4 -fno-strict-aliasing -fno-strict-aliasing -ffunction-sections -fdata-sections -ffunction-sections -fdata-sections -O2 -pipe -march=pentium4 -mtune=pentium4 -Wno-error -w -isystem/usr/local/include -I/usr/local/include -pthread -L/usr/local/lib -L/usr/local/lib -Wl,-z,origin -Wl,-rpath,\$$ORIGIN conftest.c -lm 1>&5
/tmp/conftest-RELRIW.o: In function `main':
conftest.c:(.text.main+0x7): undefined reference to `stat64'
clang: error: linker command failed with exit code 1 (use -v to see invocation)
configure: failed program was:
#line 10784 "configure"
#include "confdefs.h"
/* System header to define __stub macros and hopefully few prototypes,
which can conflict with char stat64(); below. */
#include <assert.h>
/* Override any gcc2 internal prototype to avoid an error. */
/* We use char because int might match the return type of a gcc2
builtin and then its argument prototype would still apply. */
char stat64();
int main() {
/* The GNU C library defines this for functions which it implements
to always fail with ENOSYS. Some functions are actually named
something starting with __ and the normal name is an alias. */
#if defined (__stub_stat64) || defined (__stub___stat64)
choke me
#else
stat64();
#endif
; return 0; }
configure:10779: checking for lstat64
configure:10807: clang -o conftest -O2 -pipe -march=pentium4 -mtune=pentium4 -fno-strict-aliasing -fno-strict-aliasing -ffunction-sections -fdata-sections -ffunction-sections -fdata-sections -O2 -pipe -march=pentium4 -mtune=pentium4 -Wno-error -w -isystem/usr/local/include -I/usr/local/include -pthread -L/usr/local/lib -L/usr/local/lib -Wl,-z,origin -Wl,-rpath,\$$ORIGIN conftest.c -lm 1>&5
/tmp/conftest-1YAtU2.o: In function `main':
conftest.c:(.text.main+0x7): undefined reference to `lstat64'
clang: error: linker command failed with exit code 1 (use -v to see invocation)
configure: failed program was:
#line 10784 "configure"
#include "confdefs.h"
/* System header to define __stub macros and hopefully few prototypes,
which can conflict with char lstat64(); below. */
#include <assert.h>
/* Override any gcc2 internal prototype to avoid an error. */
/* We use char because int might match the return type of a gcc2
builtin and then its argument prototype would still apply. */
char lstat64();
int main() {
/* The GNU C library defines this for functions which it implements
to always fail with ENOSYS. Some functions are actually named
something starting with __ and the normal name is an alias. */
#if defined (__stub_lstat64) || defined (__stub___lstat64)
choke me
#else
lstat64();
#endif
; return 0; }
configure:10779: checking for truncate64
configure:10807: clang -o conftest -O2 -pipe -march=pentium4 -mtune=pentium4 -fno-strict-aliasing -fno-strict-aliasing -ffunction-sections -fdata-sections -ffunction-sections -fdata-sections -O2 -pipe -march=pentium4 -mtune=pentium4 -Wno-error -w -isystem/usr/local/include -I/usr/local/include -pthread -L/usr/local/lib -L/usr/local/lib -Wl,-z,origin -Wl,-rpath,\$$ORIGIN conftest.c -lm 1>&5
/tmp/conftest-0r9oY2.o: In function `main':
conftest.c:(.text.main+0x7): undefined reference to `truncate64'
clang: error: linker command failed with exit code 1 (use -v to see invocation)
configure: failed program was:
#line 10784 "configure"
#include "confdefs.h"
/* System header to define __stub macros and hopefully few prototypes,
which can conflict with char truncate64(); below. */
#include <assert.h>
/* Override any gcc2 internal prototype to avoid an error. */
/* We use char because int might match the return type of a gcc2
builtin and then its argument prototype would still apply. */
char truncate64();
int main() {
/* The GNU C library defines this for functions which it implements
to always fail with ENOSYS. Some functions are actually named
something starting with __ and the normal name is an alias. */
#if defined (__stub_truncate64) || defined (__stub___truncate64)
choke me
#else
truncate64();
#endif
; return 0; }
configure:10779: checking for statvfs64
configure:10807: clang -o conftest -O2 -pipe -march=pentium4 -mtune=pentium4 -fno-strict-aliasing -fno-strict-aliasing -ffunction-sections -fdata-sections -ffunction-sections -fdata-sections -O2 -pipe -march=pentium4 -mtune=pentium4 -Wno-error -w -isystem/usr/local/include -I/usr/local/include -pthread -L/usr/local/lib -L/usr/local/lib -Wl,-z,origin -Wl,-rpath,\$$ORIGIN conftest.c -lm 1>&5
/tmp/conftest-8pF6qx.o: In function `main':
conftest.c:(.text.main+0x7): undefined reference to `statvfs64'
clang: error: linker command failed with exit code 1 (use -v to see invocation)
configure: failed program was:
#line 10784 "configure"
#include "confdefs.h"
/* System header to define __stub macros and hopefully few prototypes,
which can conflict with char statvfs64(); below. */
#include <assert.h>
/* Override any gcc2 internal prototype to avoid an error. */
/* We use char because int might match the return type of a gcc2
builtin and then its argument prototype would still apply. */
char statvfs64();
int main() {
/* The GNU C library defines this for functions which it implements
to always fail with ENOSYS. Some functions are actually named
something starting with __ and the normal name is an alias. */
#if defined (__stub_statvfs64) || defined (__stub___statvfs64)
choke me
#else
statvfs64();
#endif
; return 0; }
configure:10837: checking for flockfile
configure:10865: clang -o conftest -O2 -pipe -march=pentium4 -mtune=pentium4 -fno-strict-aliasing -fno-strict-aliasing -ffunction-sections -fdata-sections -ffunction-sections -fdata-sections -O2 -pipe -march=pentium4 -mtune=pentium4 -Wno-error -w -isystem/usr/local/include -I/usr/local/include -pthread -L/usr/local/lib -L/usr/local/lib -Wl,-z,origin -Wl,-rpath,\$$ORIGIN conftest.c -lm 1>&5
configure:10837: checking for getpagesize
configure:10865: clang -o conftest -O2 -pipe -march=pentium4 -mtune=pentium4 -fno-strict-aliasing -fno-strict-aliasing -ffunction-sections -fdata-sections -ffunction-sections -fdata-sections -O2 -pipe -march=pentium4 -mtune=pentium4 -Wno-error -w -isystem/usr/local/include -I/usr/local/include -pthread -L/usr/local/lib -L/usr/local/lib -Wl,-z,origin -Wl,-rpath,\$$ORIGIN conftest.c -lm 1>&5
configure:10895: checking for localtime_r
configure:10923: clang -o conftest -O2 -pipe -march=pentium4 -mtune=pentium4 -fno-strict-aliasing -fno-strict-aliasing -ffunction-sections -fdata-sections -ffunction-sections -fdata-sections -O2 -pipe -march=pentium4 -mtune=pentium4 -Wno-error -w -isystem/usr/local/include -I/usr/local/include -pthread -L/usr/local/lib -L/usr/local/lib -Wl,-z,origin -Wl,-rpath,\$$ORIGIN conftest.c -lm 1>&5
configure:10895: checking for strtok_r
configure:10923: clang -o conftest -O2 -pipe -march=pentium4 -mtune=pentium4 -fno-strict-aliasing -fno-strict-aliasing -ffunction-sections -fdata-sections -ffunction-sections -fdata-sections -O2 -pipe -march=pentium4 -mtune=pentium4 -Wno-error -w -isystem/usr/local/include -I/usr/local/include -pthread -L/usr/local/lib -L/usr/local/lib -Wl,-z,origin -Wl,-rpath,\$$ORIGIN conftest.c -lm 1>&5
configure:10961: checking for wcrtomb
configure:10973: clang++ -o conftest -O2 -pipe -march=pentium4 -mtune=pentium4 -fno-strict-aliasing -O2 -pipe -march=pentium4 -mtune=pentium4 -Wno-error -w -fno-exceptions -fno-strict-aliasing -fno-rtti -ffunction-sections -fdata-sections -fno-exceptions -std=gnu++0x -fno-rtti -ffunction-sections -fdata-sections -fno-exceptions -O2 -pipe -march=pentium4 -mtune=pentium4 -Wno-error -w -isystem/usr/local/include -I/usr/local/include -pthread -L/usr/local/lib -L/usr/local/lib -Wl,-z,origin -Wl,-rpath,\$$ORIGIN conftest.C -lm 1>&5
Stack dump:
0. Program arguments: /usr/bin/clang++ -cc1 -triple i386-unknown-freebsd9.0 -emit-obj -disable-free -main-file-name conftest.C -mrelocation-model static -mdisable-fp-elim -relaxed-aliasing -masm-verbose -mconstructor-aliases -target-cpu pentium4 -momit-leaf-frame-pointer -ffunction-sections -ffunction-sections -fdata-sections -fdata-sections -resource-dir /usr/bin/../lib/clang/3.0 -isystem /usr/local/include -I /usr/local/include -fmodule-cache-path /tmp/clang-module-cache -O2 -Wno-error -Wno-error -w -std=gnu++0x -fdeprecated-macro -ferror-limit 19 -fmessage-length 0 -pthread -fno-rtti -fgnu-runtime -fobjc-runtime-has-arc -fobjc-runtime-has-weak -fobjc-fragile-abi -fdiagnostics-show-option -o /tmp/conftest-1Vlxg0.o -x c++ conftest.C
1. <eof> parser at end of file
2. configure:10968:5: LLVM IR generation of declaration 'main'
3. configure:10968:5: Generating code for declaration 'main'
4. configure:10968:12: LLVM IR generation of compound statement ('{}')
clang++: error: unable to execute command: Illegal instruction: 4 (core dumped)
clang++: error: clang frontend command failed due to signal 2 (use -v to see invocation)
clang++: note: diagnostic msg: Please submit a bug report to http://llvm.org/bugs/ and include command line arguments and all diagnostic information.
clang++: note: diagnostic msg: Preprocessed source(s) are located at:
clang++: note: diagnostic msg: /tmp/conftest-0Cta5z.ii
configure: failed program was:
#line 10966 "configure"
#include "confdefs.h"
#include <wchar.h>
int main() {
mbstate_t ps={0};wcrtomb(0,'f',&ps);
; return 0; }
configure:10996: checking for mbrtowc
configure:11008: clang++ -o conftest -O2 -pipe -march=pentium4 -mtune=pentium4 -fno-strict-aliasing -O2 -pipe -march=pentium4 -mtune=pentium4 -Wno-error -w -fno-exceptions -fno-strict-aliasing -fno-rtti -ffunction-sections -fdata-sections -fno-exceptions -std=gnu++0x -fno-rtti -ffunction-sections -fdata-sections -fno-exceptions -O2 -pipe -march=pentium4 -mtune=pentium4 -Wno-error -w -isystem/usr/local/include -I/usr/local/include -pthread -L/usr/local/lib -L/usr/local/lib -Wl,-z,origin -Wl,-rpath,\$$ORIGIN conftest.C -lm 1>&5
Stack dump:
0. Program arguments: /usr/bin/clang++ -cc1 -triple i386-unknown-freebsd9.0 -emit-obj -disable-free -main-file-name conftest.C -mrelocation-model static -mdisable-fp-elim -relaxed-aliasing -masm-verbose -mconstructor-aliases -target-cpu pentium4 -momit-leaf-frame-pointer -ffunction-sections -ffunction-sections -fdata-sections -fdata-sections -resource-dir /usr/bin/../lib/clang/3.0 -isystem /usr/local/include -I /usr/local/include -fmodule-cache-path /tmp/clang-module-cache -O2 -Wno-error -Wno-error -w -std=gnu++0x -fdeprecated-macro -ferror-limit 19 -fmessage-length 0 -pthread -fno-rtti -fgnu-runtime -fobjc-runtime-has-arc -fobjc-runtime-has-weak -fobjc-fragile-abi -fdiagnostics-show-option -o /tmp/conftest-6V5yZK.o -x c++ conftest.C
1. <eof> parser at end of file
2. configure:11003:5: LLVM IR generation of declaration 'main'
3. configure:11003:5: Generating code for declaration 'main'
4. configure:11003:12: LLVM IR generation of compound statement ('{}')
clang++: error: unable to execute command: Illegal instruction: 4 (core dumped)
clang++: error: clang frontend command failed due to signal 2 (use -v to see invocation)
clang++: note: diagnostic msg: Please submit a bug report to http://llvm.org/bugs/ and include command line arguments and all diagnostic information.
clang++: note: diagnostic msg: Preprocessed source(s) are located at:
clang++: note: diagnostic msg: /tmp/conftest-varbt6.ii
configure: failed program was:
#line 11001 "configure"
#include "confdefs.h"
#include <wchar.h>
int main() {
mbstate_t ps={0};mbrtowc(0,0,0,&ps);
; return 0; }
configure:11040: checking for res_ninit()
configure:11057: clang -o conftest -O2 -pipe -march=pentium4 -mtune=pentium4 -fno-strict-aliasing -fno-strict-aliasing -ffunction-sections -fdata-sections -ffunction-sections -fdata-sections -O2 -pipe -march=pentium4 -mtune=pentium4 -Wno-error -w -isystem/usr/local/include -I/usr/local/include -pthread -L/usr/local/lib -L/usr/local/lib -Wl,-z,origin -Wl,-rpath,\$$ORIGIN conftest.c -lm 1>&5
In file included from configure:11050:
/usr/include/resolv.h:157:14: error: array has incomplete element type 'struct sockaddr_in'
nsaddr_list[MAXNS]; /*%< address of name server */
^
/usr/include/resolv.h:156:9: note: forward declaration of 'struct sockaddr_in'
struct sockaddr_in
^
/usr/include/resolv.h:171:18: error: field has incomplete type 'struct in_addr'
struct in_addr addr;
^
/usr/include/resolv.h:171:10: note: forward declaration of 'struct in_addr'
struct in_addr addr;
^
/usr/include/resolv.h:195:21: error: field has incomplete type 'struct sockaddr_in'
struct sockaddr_in sin;
^
/usr/include/resolv.h:156:9: note: forward declaration of 'struct sockaddr_in'
struct sockaddr_in
^
3 errors generated.
configure: failed program was:
#line 11045 "configure"
#include "confdefs.h"
#ifdef linux
#define _BSD_SOURCE 1
#endif
#include <resolv.h>
int main() {
int foo = res_ninit(&_res);
; return 0; }
configure:11090: checking for gnu_get_libc_version()
configure:11106: clang++ -o conftest -O2 -pipe -march=pentium4 -mtune=pentium4 -fno-strict-aliasing -O2 -pipe -march=pentium4 -mtune=pentium4 -Wno-error -w -fno-exceptions -fno-strict-aliasing -fno-rtti -ffunction-sections -fdata-sections -fno-exceptions -std=gnu++0x -fno-rtti -ffunction-sections -fdata-sections -fno-exceptions -O2 -pipe -march=pentium4 -mtune=pentium4 -Wno-error -w -isystem/usr/local/include -I/usr/local/include -pthread -L/usr/local/lib -L/usr/local/lib -Wl,-z,origin -Wl,-rpath,\$$ORIGIN conftest.C -lm 1>&5
configure:11102:29: error: use of undeclared identifier 'gnu_get_libc_version'
const char *glibc_version = gnu_get_libc_version();
^
1 error generated.
configure: failed program was:
#line 11095 "configure"
#include "confdefs.h"
#ifdef HAVE_GNU_LIBC_VERSION_H
#include <gnu/libc-version.h>
#endif
int main() {
const char *glibc_version = gnu_get_libc_version();
; return 0; }
configure:11138: checking for iconv in -lc
configure:11160: clang++ -o conftest -O2 -pipe -march=pentium4 -mtune=pentium4 -fno-strict-aliasing -O2 -pipe -march=pentium4 -mtune=pentium4 -Wno-error -w -fno-exceptions -fno-strict-aliasing -fno-rtti -ffunction-sections -fdata-sections -fno-exceptions -std=gnu++0x -fno-rtti -ffunction-sections -fdata-sections -fno-exceptions -O2 -pipe -march=pentium4 -mtune=pentium4 -Wno-error -w -isystem/usr/local/include -I/usr/local/include -pthread -L/usr/local/lib -L/usr/local/lib -Wl,-z,origin -Wl,-rpath,\$$ORIGIN conftest.C -lc -lm 1>&5
/tmp/conftest-cay6v6.o: In function `main':
conftest.C:(.text.main+0x7): undefined reference to `iconv'
clang++: error: linker command failed with exit code 1 (use -v to see invocation)
configure: failed program was:
#line 11146 "configure"
#include "confdefs.h"
/* Override any gcc2 internal prototype to avoid an error. */
#ifdef __cplusplus
extern "C"
#endif
/* We use char because int might match the return type of a gcc2
builtin and then its argument prototype would still apply. */
char iconv();
int main() {
iconv()
; return 0; }
configure:11179: checking for iconv in -liconv
configure:11201: clang++ -o conftest -O2 -pipe -march=pentium4 -mtune=pentium4 -fno-strict-aliasing -O2 -pipe -march=pentium4 -mtune=pentium4 -Wno-error -w -fno-exceptions -fno-strict-aliasing -fno-rtti -ffunction-sections -fdata-sections -fno-exceptions -std=gnu++0x -fno-rtti -ffunction-sections -fdata-sections -fno-exceptions -O2 -pipe -march=pentium4 -mtune=pentium4 -Wno-error -w -isystem/usr/local/include -I/usr/local/include -pthread -L/usr/local/lib -L/usr/local/lib -Wl,-z,origin -Wl,-rpath,\$$ORIGIN conftest.C -liconv -lm 1>&5
configure:11269: checking for iconv()
configure:11288: clang++ -o conftest -O2 -pipe -march=pentium4 -mtune=pentium4 -fno-strict-aliasing -O2 -pipe -march=pentium4 -mtune=pentium4 -Wno-error -w -fno-exceptions -fno-strict-aliasing -fno-rtti -ffunction-sections -fdata-sections -fno-exceptions -std=gnu++0x -fno-rtti -ffunction-sections -fdata-sections -fno-exceptions -O2 -pipe -march=pentium4 -mtune=pentium4 -Wno-error -w -isystem/usr/local/include -I/usr/local/include -pthread -L/usr/local/lib -L/usr/local/lib -Wl,-z,origin -Wl,-rpath,\$$ORIGIN conftest.C -lm -liconv 1>&5
configure:11315: checking for iconv() with const input
configure:11335: clang++ -c -O2 -pipe -march=pentium4 -mtune=pentium4 -fno-strict-aliasing -O2 -pipe -march=pentium4 -mtune=pentium4 -Wno-error -w -fno-exceptions -fno-strict-aliasing -fno-rtti -ffunction-sections -fdata-sections -fno-exceptions -std=gnu++0x -fno-rtti -ffunction-sections -fdata-sections -fno-exceptions -O2 -pipe -march=pentium4 -mtune=pentium4 -Wno-error -w -isystem/usr/local/include -I/usr/local/include conftest.C 1>&5
configure:11367: checking for nl_langinfo and CODESET
configure:11379: clang++ -o conftest -O2 -pipe -march=pentium4 -mtune=pentium4 -fno-strict-aliasing -O2 -pipe -march=pentium4 -mtune=pentium4 -Wno-error -w -fno-exceptions -fno-strict-aliasing -fno-rtti -ffunction-sections -fdata-sections -fno-exceptions -std=gnu++0x -fno-rtti -ffunction-sections -fdata-sections -fno-exceptions -O2 -pipe -march=pentium4 -mtune=pentium4 -Wno-error -w -isystem/usr/local/include -I/usr/local/include -pthread -L/usr/local/lib -L/usr/local/lib -Wl,-z,origin -Wl,-rpath,\$$ORIGIN conftest.C -lm 1>&5
configure:11414: checking for an implementation of va_copy()
configure:11438: clang -o conftest -O2 -pipe -march=pentium4 -mtune=pentium4 -fno-strict-aliasing -fno-strict-aliasing -ffunction-sections -fdata-sections -ffunction-sections -fdata-sections -O2 -pipe -march=pentium4 -mtune=pentium4 -Wno-error -w -isystem/usr/local/include -I/usr/local/include -pthread -L/usr/local/lib -L/usr/local/lib -Wl,-z,origin -Wl,-rpath,\$$ORIGIN conftest.c -lm 1>&5
configure:11455: checking for an implementation of __va_copy()
configure:11479: clang -o conftest -O2 -pipe -march=pentium4 -mtune=pentium4 -fno-strict-aliasing -fno-strict-aliasing -ffunction-sections -fdata-sections -ffunction-sections -fdata-sections -O2 -pipe -march=pentium4 -mtune=pentium4 -Wno-error -w -isystem/usr/local/include -I/usr/local/include -pthread -L/usr/local/lib -L/usr/local/lib -Wl,-z,origin -Wl,-rpath,\$$ORIGIN conftest.c -lm 1>&5
/tmp/conftest-4GWTqP.o: In function `f':
conftest.c:(.text.f+0x17): undefined reference to `__va_copy'
clang: error: linker command failed with exit code 1 (use -v to see invocation)
configure: failed program was:
#line 11465 "configure"
#include "confdefs.h"
#include <stdarg.h>
void f (int i, ...) {
va_list args1, args2;
va_start (args1, i);
__va_copy (args2, args1);
if (va_arg (args2, int) != 42 || va_arg (args1, int) != 42)
exit (1);
va_end (args1); va_end (args2);
}
int main() { f (0, 42); return 0; }
configure:11496: checking whether va_lists can be copied by value
configure:11520: clang -o conftest -O2 -pipe -march=pentium4 -mtune=pentium4 -fno-strict-aliasing -fno-strict-aliasing -ffunction-sections -fdata-sections -ffunction-sections -fdata-sections -O2 -pipe -march=pentium4 -mtune=pentium4 -Wno-error -w -isystem/usr/local/include -I/usr/local/include -pthread -L/usr/local/lib -L/usr/local/lib -Wl,-z,origin -Wl,-rpath,\$$ORIGIN conftest.c -lm 1>&5
configure:11642: checking for gcc 3.0 ABI
configure:11660: clang++ -c -O2 -pipe -march=pentium4 -mtune=pentium4 -fno-strict-aliasing -O2 -pipe -march=pentium4 -mtune=pentium4 -Wno-error -w -fno-exceptions -fno-strict-aliasing -fno-rtti -ffunction-sections -fdata-sections -fno-exceptions -std=gnu++0x -fno-rtti -ffunction-sections -fdata-sections -fno-exceptions -O2 -pipe -march=pentium4 -mtune=pentium4 -Wno-error -w -isystem/usr/local/include -I/usr/local/include conftest.C 1>&5
configure:11684: checking for C++ "explicit" keyword
configure:11699: clang++ -c -O2 -pipe -march=pentium4 -mtune=pentium4 -fno-strict-aliasing -O2 -pipe -march=pentium4 -mtune=pentium4 -Wno-error -w -fno-exceptions -fno-strict-aliasing -fno-rtti -ffunction-sections -fdata-sections -fno-exceptions -std=gnu++0x -fno-rtti -ffunction-sections -fdata-sections -fno-exceptions -O2 -pipe -march=pentium4 -mtune=pentium4 -Wno-error -w -isystem/usr/local/include -I/usr/local/include conftest.C 1>&5
configure:11723: checking for C++ "typename" keyword
configure:11747: clang++ -c -O2 -pipe -march=pentium4 -mtune=pentium4 -fno-strict-aliasing -O2 -pipe -march=pentium4 -mtune=pentium4 -Wno-error -w -fno-exceptions -fno-strict-aliasing -fno-rtti -ffunction-sections -fdata-sections -fno-exceptions -std=gnu++0x -fno-rtti -ffunction-sections -fdata-sections -fno-exceptions -O2 -pipe -march=pentium4 -mtune=pentium4 -Wno-error -w -isystem/usr/local/include -I/usr/local/include conftest.C 1>&5
configure:11771: checking for modern C++ template specialization syntax support
configure:11786: clang++ -c -O2 -pipe -march=pentium4 -mtune=pentium4 -fno-strict-aliasing -O2 -pipe -march=pentium4 -mtune=pentium4 -Wno-error -w -fno-exceptions -fno-strict-aliasing -fno-rtti -ffunction-sections -fdata-sections -fno-exceptions -std=gnu++0x -fno-rtti -ffunction-sections -fdata-sections -fno-exceptions -O2 -pipe -march=pentium4 -mtune=pentium4 -Wno-error -w -isystem/usr/local/include -I/usr/local/include conftest.C 1>&5
configure:11811: checking whether partial template specialization works
configure:11824: clang++ -c -O2 -pipe -march=pentium4 -mtune=pentium4 -fno-strict-aliasing -O2 -pipe -march=pentium4 -mtune=pentium4 -Wno-error -w -fno-exceptions -fno-strict-aliasing -fno-rtti -ffunction-sections -fdata-sections -fno-exceptions -std=gnu++0x -fno-rtti -ffunction-sections -fdata-sections -fno-exceptions -O2 -pipe -march=pentium4 -mtune=pentium4 -Wno-error -w -isystem/usr/local/include -I/usr/local/include conftest.C 1>&5
configure:11848: checking whether operators must be re-defined for templates derived from templates
configure:11865: clang++ -c -O2 -pipe -march=pentium4 -mtune=pentium4 -fno-strict-aliasing -O2 -pipe -march=pentium4 -mtune=pentium4 -Wno-error -w -fno-exceptions -fno-strict-aliasing -fno-rtti -ffunction-sections -fdata-sections -fno-exceptions -std=gnu++0x -fno-rtti -ffunction-sections -fdata-sections -fno-exceptions -O2 -pipe -march=pentium4 -mtune=pentium4 -Wno-error -w -isystem/usr/local/include -I/usr/local/include conftest.C 1>&5
configure:11890: checking whether we need to cast a derived template to pass as its base class
configure:11904: clang++ -c -O2 -pipe -march=pentium4 -mtune=pentium4 -fno-strict-aliasing -O2 -pipe -march=pentium4 -mtune=pentium4 -Wno-error -w -fno-exceptions -fno-strict-aliasing -fno-rtti -ffunction-sections -fdata-sections -fno-exceptions -std=gnu++0x -fno-rtti -ffunction-sections -fdata-sections -fno-exceptions -O2 -pipe -march=pentium4 -mtune=pentium4 -Wno-error -w -isystem/usr/local/include -I/usr/local/include conftest.C 1>&5
configure:11928: checking whether the compiler can resolve const ambiguities for templates
configure:11954: clang++ -c -O2 -pipe -march=pentium4 -mtune=pentium4 -fno-strict-aliasing -O2 -pipe -march=pentium4 -mtune=pentium4 -Wno-error -w -fno-exceptions -fno-strict-aliasing -fno-rtti -ffunction-sections -fdata-sections -fno-exceptions -std=gnu++0x -fno-rtti -ffunction-sections -fdata-sections -fno-exceptions -O2 -pipe -march=pentium4 -mtune=pentium4 -Wno-error -w -isystem/usr/local/include -I/usr/local/include conftest.C 1>&5
configure:11979: checking whether the C++ "using" keyword can change access
configure:11992: clang++ -c -O2 -pipe -march=pentium4 -mtune=pentium4 -fno-strict-aliasing -O2 -pipe -march=pentium4 -mtune=pentium4 -Wno-error -w -fno-exceptions -fno-strict-aliasing -fno-rtti -ffunction-sections -fdata-sections -fno-exceptions -std=gnu++0x -fno-rtti -ffunction-sections -fdata-sections -fno-exceptions -O2 -pipe -march=pentium4 -mtune=pentium4 -Wno-error -w -isystem/usr/local/include -I/usr/local/include conftest.C 1>&5
configure:12003: clang++ -c -O2 -pipe -march=pentium4 -mtune=pentium4 -fno-strict-aliasing -O2 -pipe -march=pentium4 -mtune=pentium4 -Wno-error -w -fno-exceptions -fno-strict-aliasing -fno-rtti -ffunction-sections -fdata-sections -fno-exceptions -std=gnu++0x -fno-rtti -ffunction-sections -fdata-sections -fno-exceptions -O2 -pipe -march=pentium4 -mtune=pentium4 -Wno-error -w -isystem/usr/local/include -I/usr/local/include conftest.C 1>&5
configure:11999:15: error: 'foo' is a private member of 'B'
B b; return b.foo();
^
configure:11997:63: note: declared private here
class B : public A { private: using A::foo; };
^
1 error generated.
configure: failed program was:
#line 11995 "configure"
#include "confdefs.h"
class A { public: int foo() { return 1; } };
class B : public A { private: using A::foo; };
int main() {
B b; return b.foo();
; return 0; }
configure:12034: checking whether the C++ "using" keyword resolves ambiguity
configure:12055: clang++ -c -O2 -pipe -march=pentium4 -mtune=pentium4 -fno-strict-aliasing -O2 -pipe -march=pentium4 -mtune=pentium4 -Wno-error -w -fno-exceptions -fno-strict-aliasing -fno-rtti -ffunction-sections -fdata-sections -fno-exceptions -std=gnu++0x -fno-rtti -ffunction-sections -fdata-sections -fno-exceptions -O2 -pipe -march=pentium4 -mtune=pentium4 -Wno-error -w -isystem/usr/local/include -I/usr/local/include conftest.C 1>&5
configure:12079: checking for "std::" namespace
configure:12091: clang++ -c -O2 -pipe -march=pentium4 -mtune=pentium4 -fno-strict-aliasing -O2 -pipe -march=pentium4 -mtune=pentium4 -Wno-error -w -fno-exceptions -fno-strict-aliasing -fno-rtti -ffunction-sections -fdata-sections -fno-exceptions -std=gnu++0x -fno-rtti -ffunction-sections -fdata-sections -fno-exceptions -O2 -pipe -march=pentium4 -mtune=pentium4 -Wno-error -w -isystem/usr/local/include -I/usr/local/include conftest.C 1>&5
configure:12115: checking whether standard template operator!=() is ambiguous
configure:12130: clang++ -c -O2 -pipe -march=pentium4 -mtune=pentium4 -fno-strict-aliasing -O2 -pipe -march=pentium4 -mtune=pentium4 -Wno-error -w -fno-exceptions -fno-strict-aliasing -fno-rtti -ffunction-sections -fdata-sections -fno-exceptions -std=gnu++0x -fno-rtti -ffunction-sections -fdata-sections -fno-exceptions -O2 -pipe -march=pentium4 -mtune=pentium4 -Wno-error -w -isystem/usr/local/include -I/usr/local/include conftest.C 1>&5
configure:12155: checking for C++ reinterpret_cast
configure:12168: clang++ -c -O2 -pipe -march=pentium4 -mtune=pentium4 -fno-strict-aliasing -O2 -pipe -march=pentium4 -mtune=pentium4 -Wno-error -w -fno-exceptions -fno-strict-aliasing -fno-rtti -ffunction-sections -fdata-sections -fno-exceptions -std=gnu++0x -fno-rtti -ffunction-sections -fdata-sections -fno-exceptions -O2 -pipe -march=pentium4 -mtune=pentium4 -Wno-error -w -isystem/usr/local/include -I/usr/local/include conftest.C 1>&5
configure:12192: checking for C++ dynamic_cast to void*
configure:12219: clang++ -o conftest -O2 -pipe -march=pentium4 -mtune=pentium4 -fno-strict-aliasing -O2 -pipe -march=pentium4 -mtune=pentium4 -Wno-error -w -fno-exceptions -fno-strict-aliasing -fno-rtti -ffunction-sections -fdata-sections -fno-exceptions -std=gnu++0x -fno-rtti -ffunction-sections -fdata-sections -fno-exceptions -O2 -pipe -march=pentium4 -mtune=pentium4 -Wno-error -w -isystem/usr/local/include -I/usr/local/include -pthread -L/usr/local/lib -L/usr/local/lib -Wl,-z,origin -Wl,-rpath,\$$ORIGIN conftest.C -lm 1>&5
configure:12246: checking whether C++ requires implementation of unused virtual methods
configure:12258: clang++ -o conftest -O2 -pipe -march=pentium4 -mtune=pentium4 -fno-strict-aliasing -O2 -pipe -march=pentium4 -mtune=pentium4 -Wno-error -w -fno-exceptions -fno-strict-aliasing -fno-rtti -ffunction-sections -fdata-sections -fno-exceptions -std=gnu++0x -fno-rtti -ffunction-sections -fdata-sections -fno-exceptions -O2 -pipe -march=pentium4 -mtune=pentium4 -Wno-error -w -isystem/usr/local/include -I/usr/local/include -pthread -L/usr/local/lib -L/usr/local/lib -Wl,-z,origin -Wl,-rpath,\$$ORIGIN conftest.C -lm 1>&5
configure:12284: checking for trouble comparing to zero near std::operator!=()
configure:12300: clang++ -c -O2 -pipe -march=pentium4 -mtune=pentium4 -fno-strict-aliasing -O2 -pipe -march=pentium4 -mtune=pentium4 -Wno-error -w -fno-exceptions -fno-strict-aliasing -fno-rtti -ffunction-sections -fdata-sections -fno-exceptions -std=gnu++0x -fno-rtti -ffunction-sections -fdata-sections -fno-exceptions -O2 -pipe -march=pentium4 -mtune=pentium4 -Wno-error -w -isystem/usr/local/include -I/usr/local/include conftest.C 1>&5
configure:12330: checking for __thread keyword for TLS variables
configure:12384: checking for malloc.h
configure:12418: checking for malloc/malloc.h
configure:12428: clang++ -E -O2 -pipe -march=pentium4 -mtune=pentium4 -Wno-error -w -isystem/usr/local/include -I/usr/local/include conftest.C >/dev/null 2>conftest.out
configure:12424:10: fatal error: 'malloc/malloc.h' file not found
#include <malloc/malloc.h>
^
1 error generated.
configure: failed program was:
#line 12423 "configure"
#include "confdefs.h"
#include <malloc/malloc.h>
configure:12452: checking for sys/malloc.h
configure:12462: clang++ -E -O2 -pipe -march=pentium4 -mtune=pentium4 -Wno-error -w -isystem/usr/local/include -I/usr/local/include conftest.C >/dev/null 2>conftest.out
configure:12499: checking for strndup
configure:12530: clang++ -o conftest -O2 -pipe -march=pentium4 -mtune=pentium4 -fno-strict-aliasing -O2 -pipe -march=pentium4 -mtune=pentium4 -Wno-error -w -fno-exceptions -fno-strict-aliasing -fno-rtti -ffunction-sections -fdata-sections -fno-exceptions -std=gnu++0x -fno-rtti -ffunction-sections -fdata-sections -fno-exceptions -O2 -pipe -march=pentium4 -mtune=pentium4 -Wno-error -w -isystem/usr/local/include -I/usr/local/include -pthread -L/usr/local/lib -L/usr/local/lib -Wl,-z,origin -Wl,-rpath,\$$ORIGIN conftest.C -lm 1>&5
configure:12499: checking for posix_memalign
configure:12530: clang++ -o conftest -O2 -pipe -march=pentium4 -mtune=pentium4 -fno-strict-aliasing -O2 -pipe -march=pentium4 -mtune=pentium4 -Wno-error -w -fno-exceptions -fno-strict-aliasing -fno-rtti -ffunction-sections -fdata-sections -fno-exceptions -std=gnu++0x -fno-rtti -ffunction-sections -fdata-sections -fno-exceptions -O2 -pipe -march=pentium4 -mtune=pentium4 -Wno-error -w -isystem/usr/local/include -I/usr/local/include -pthread -L/usr/local/lib -L/usr/local/lib -Wl,-z,origin -Wl,-rpath,\$$ORIGIN conftest.C -lm 1>&5
configure:12499: checking for memalign
configure:12530: clang++ -o conftest -O2 -pipe -march=pentium4 -mtune=pentium4 -fno-strict-aliasing -O2 -pipe -march=pentium4 -mtune=pentium4 -Wno-error -w -fno-exceptions -fno-strict-aliasing -fno-rtti -ffunction-sections -fdata-sections -fno-exceptions -std=gnu++0x -fno-rtti -ffunction-sections -fdata-sections -fno-exceptions -O2 -pipe -march=pentium4 -mtune=pentium4 -Wno-error -w -isystem/usr/local/include -I/usr/local/include -pthread -L/usr/local/lib -L/usr/local/lib -Wl,-z,origin -Wl,-rpath,\$$ORIGIN conftest.C -lm 1>&5
/tmp/conftest-zOoc41.o: In function `main':
conftest.C:(.text.main+0x7): undefined reference to `memalign'
clang++: error: linker command failed with exit code 1 (use -v to see invocation)
configure: failed program was:
#line 12504 "configure"
#include "confdefs.h"
/* System header to define __stub macros and hopefully few prototypes,
which can conflict with char memalign(); below. */
#include <assert.h>
/* Override any gcc2 internal prototype to avoid an error. */
#ifdef __cplusplus
extern "C"
#endif
/* We use char because int might match the return type of a gcc2
builtin and then its argument prototype would still apply. */
char memalign();
int main() {
/* The GNU C library defines this for functions which it implements
to always fail with ENOSYS. Some functions are actually named
something starting with __ and the normal name is an alias. */
#if defined (__stub_memalign) || defined (__stub___memalign)
choke me
#else
memalign();
#endif
; return 0; }
configure:12499: checking for valloc
configure:12530: clang++ -o conftest -O2 -pipe -march=pentium4 -mtune=pentium4 -fno-strict-aliasing -O2 -pipe -march=pentium4 -mtune=pentium4 -Wno-error -w -fno-exceptions -fno-strict-aliasing -fno-rtti -ffunction-sections -fdata-sections -fno-exceptions -std=gnu++0x -fno-rtti -ffunction-sections -fdata-sections -fno-exceptions -O2 -pipe -march=pentium4 -mtune=pentium4 -Wno-error -w -isystem/usr/local/include -I/usr/local/include -pthread -L/usr/local/lib -L/usr/local/lib -Wl,-z,origin -Wl,-rpath,\$$ORIGIN conftest.C -lm 1>&5
configure:12560: checking for __attribute__((always_inline))
configure:12572: clang++ -c -O2 -pipe -march=pentium4 -mtune=pentium4 -fno-strict-aliasing -O2 -pipe -march=pentium4 -mtune=pentium4 -Wno-error -w -fno-exceptions -fno-strict-aliasing -fno-rtti -ffunction-sections -fdata-sections -fno-exceptions -std=gnu++0x -fno-rtti -ffunction-sections -fdata-sections -fno-exceptions -O2 -pipe -march=pentium4 -mtune=pentium4 -Wno-error -w -isystem/usr/local/include -I/usr/local/include conftest.C 1>&5
configure:12587: checking for __attribute__((malloc))
configure:12599: clang++ -c -O2 -pipe -march=pentium4 -mtune=pentium4 -fno-strict-aliasing -O2 -pipe -march=pentium4 -mtune=pentium4 -Wno-error -w -fno-exceptions -fno-strict-aliasing -fno-rtti -ffunction-sections -fdata-sections -fno-exceptions -std=gnu++0x -fno-rtti -ffunction-sections -fdata-sections -fno-exceptions -O2 -pipe -march=pentium4 -mtune=pentium4 -Wno-error -w -isystem/usr/local/include -I/usr/local/include conftest.C 1>&5
configure:12614: checking for __attribute__((warn_unused_result))
configure:12626: clang++ -c -O2 -pipe -march=pentium4 -mtune=pentium4 -fno-strict-aliasing -O2 -pipe -march=pentium4 -mtune=pentium4 -Wno-error -w -fno-exceptions -fno-strict-aliasing -fno-rtti -ffunction-sections -fdata-sections -fno-exceptions -std=gnu++0x -fno-rtti -ffunction-sections -fdata-sections -fno-exceptions -O2 -pipe -march=pentium4 -mtune=pentium4 -Wno-error -w -isystem/usr/local/include -I/usr/local/include conftest.C 1>&5
configure:12641: checking for __attribute__((noreturn))
configure:12653: clang++ -c -O2 -pipe -march=pentium4 -mtune=pentium4 -fno-strict-aliasing -O2 -pipe -march=pentium4 -mtune=pentium4 -Wno-error -w -fno-exceptions -fno-strict-aliasing -fno-rtti -ffunction-sections -fdata-sections -fno-exceptions -std=gnu++0x -fno-rtti -ffunction-sections -fdata-sections -fno-exceptions -O2 -pipe -march=pentium4 -mtune=pentium4 -Wno-error -w -isystem/usr/local/include -I/usr/local/include conftest.C 1>&5
configure:12677: checking for LC_MESSAGES
configure:12689: clang -c -O2 -pipe -march=pentium4 -mtune=pentium4 -fno-strict-aliasing -fno-strict-aliasing -ffunction-sections -fdata-sections -ffunction-sections -fdata-sections -O2 -pipe -march=pentium4 -mtune=pentium4 -Wno-error -w -isystem/usr/local/include -I/usr/local/include conftest.c 1>&5
configure:12715: checking for localeconv
configure:12743: clang -o conftest -O2 -pipe -march=pentium4 -mtune=pentium4 -fno-strict-aliasing -fno-strict-aliasing -ffunction-sections -fdata-sections -ffunction-sections -fdata-sections -O2 -pipe -march=pentium4 -mtune=pentium4 -Wno-error -w -isystem/usr/local/include -I/usr/local/include -pthread -L/usr/local/lib -L/usr/local/lib -Wl,-z,origin -Wl,-rpath,\$$ORIGIN conftest.c -lm 1>&5
configure:12969: checking for nspr-config
configure:13004: checking for NSPR - version >= 4.9.3
configure:13072: clang -c -O2 -pipe -march=pentium4 -mtune=pentium4 -fno-strict-aliasing -fno-strict-aliasing -ffunction-sections -fdata-sections -ffunction-sections -fdata-sections -I/usr/local/include/nspr -O2 -pipe -march=pentium4 -mtune=pentium4 -Wno-error -w -isystem/usr/local/include -I/usr/local/include conftest.c 1>&5
configure:13148: checking for nss-config
configure:13183: checking for NSS - version >= 3.14
configure:13273: checking for jpeg_destroy_compress in -ljpeg
configure:13292: clang -o conftest -I/usr/local/include -O2 -pipe -march=pentium4 -mtune=pentium4 -fno-strict-aliasing -fno-strict-aliasing -ffunction-sections -fdata-sections -ffunction-sections -fdata-sections -O2 -pipe -march=pentium4 -mtune=pentium4 -Wno-error -w -isystem/usr/local/include -I/usr/local/include -L/usr/local/lib -pthread -L/usr/local/lib -L/usr/local/lib -Wl,-z,origin -Wl,-rpath,\$$ORIGIN conftest.c -ljpeg -lm 1>&5
configure:13328: clang -c -I/usr/local/include -O2 -pipe -march=pentium4 -mtune=pentium4 -fno-strict-aliasing -fno-strict-aliasing -ffunction-sections -fdata-sections -ffunction-sections -fdata-sections -O2 -pipe -march=pentium4 -mtune=pentium4 -Wno-error -w -isystem/usr/local/include -I/usr/local/include conftest.c 1>&5
configure:13376: checking for gzread in -lz
configure:13395: clang -o conftest -O2 -pipe -march=pentium4 -mtune=pentium4 -fno-strict-aliasing -fno-strict-aliasing -ffunction-sections -fdata-sections -ffunction-sections -fdata-sections -O2 -pipe -march=pentium4 -mtune=pentium4 -Wno-error -w -isystem/usr/local/include -I/usr/local/include -pthread -L/usr/local/lib -L/usr/local/lib -Wl,-z,origin -Wl,-rpath,\$$ORIGIN conftest.c -lz -lm 1>&5
configure:13430: clang -c -O2 -pipe -march=pentium4 -mtune=pentium4 -fno-strict-aliasing -fno-strict-aliasing -ffunction-sections -fdata-sections -ffunction-sections -fdata-sections -O2 -pipe -march=pentium4 -mtune=pentium4 -Wno-error -w -isystem/usr/local/include -I/usr/local/include conftest.c 1>&5
configure:13477: checking for BZ2_bzread in -lbz2
configure:13496: clang -o conftest -O2 -pipe -march=pentium4 -mtune=pentium4 -fno-strict-aliasing -fno-strict-aliasing -ffunction-sections -fdata-sections -ffunction-sections -fdata-sections -O2 -pipe -march=pentium4 -mtune=pentium4 -Wno-error -w -isystem/usr/local/include -I/usr/local/include -pthread -L/usr/local/lib -L/usr/local/lib -Wl,-z,origin -Wl,-rpath,\$$ORIGIN conftest.c -lbz2 -lm 1>&5
configure:13545: checking for png_get_valid in -lpng
configure:13564: clang -o conftest -I/usr/local/include -O2 -pipe -march=pentium4 -mtune=pentium4 -fno-strict-aliasing -fno-strict-aliasing -ffunction-sections -fdata-sections -ffunction-sections -fdata-sections -O2 -pipe -march=pentium4 -mtune=pentium4 -Wno-error -w -isystem/usr/local/include -I/usr/local/include -L/usr/local/lib -pthread -L/usr/local/lib -L/usr/local/lib -Wl,-z,origin -Wl,-rpath,\$$ORIGIN conftest.c -lpng -lm 1>&5
configure:13586: checking for png_get_acTL in -lpng
configure:13605: clang -o conftest -I/usr/local/include -O2 -pipe -march=pentium4 -mtune=pentium4 -fno-strict-aliasing -fno-strict-aliasing -ffunction-sections -fdata-sections -ffunction-sections -fdata-sections -O2 -pipe -march=pentium4 -mtune=pentium4 -Wno-error -w -isystem/usr/local/include -I/usr/local/include -L/usr/local/lib -pthread -L/usr/local/lib -L/usr/local/lib -Wl,-z,origin -Wl,-rpath,\$$ORIGIN conftest.c -lpng -lm 1>&5
configure:13653: clang -c -I/usr/local/include -O2 -pipe -march=pentium4 -mtune=pentium4 -fno-strict-aliasing -fno-strict-aliasing -ffunction-sections -fdata-sections -ffunction-sections -fdata-sections -O2 -pipe -march=pentium4 -mtune=pentium4 -Wno-error -w -isystem/usr/local/include -I/usr/local/include conftest.c 1>&5
configure:13695: checking for pkg-config
configure:13739: checking for hunspell
configure:13746: checking MOZ_HUNSPELL_CFLAGS
configure:13751: checking MOZ_HUNSPELL_LIBS
configure:13863: checking for application to build
configure:13882: checking if app-specific confvars.sh exists
configure:14229: checking for gtk+-2.0 >= 2.10.0 gtk+-unix-print-2.0 glib-2.0 gobject-2.0 gdk-x11-2.0
configure:14236: checking MOZ_GTK2_CFLAGS
configure:14241: checking MOZ_GTK2_LIBS
configure:14345: checking for libstartup-notification-1.0 >= 0.8
configure:14352: checking MOZ_STARTUP_NOTIFICATION_CFLAGS
configure:14357: checking MOZ_STARTUP_NOTIFICATION_LIBS
configure:14690: checking for pango >= 1.14.0 pangoft2 >= 1.14.0
configure:14697: checking MOZ_PANGO_CFLAGS
configure:14702: checking MOZ_PANGO_LIBS
configure:15153: checking for gconf-2.0 >= 1.2.1 gobject-2.0
configure:15160: checking MOZ_GCONF_CFLAGS
configure:15165: checking MOZ_GCONF_LIBS
configure:15303: checking for dbus-glib-1 >= 0.60
configure:15310: checking MOZ_DBUS_GLIB_CFLAGS
configure:15315: checking MOZ_DBUS_GLIB_LIBS
configure:15968: checking for tar archiver
configure:15974: checking for gnutar
configure:15974: checking for gtar
configure:16011: checking for wget
configure:16017: checking for wget
configure:16289: checking for sqlite3 >= 3.7.1
configure:16296: checking SQLITE_CFLAGS
configure:16301: checking SQLITE_LIBS
configure:16594: checking for valid optimization flags
configure:16605: clang -c -O2 -pipe -march=pentium4 -mtune=pentium4 -fno-strict-aliasing -fno-strict-aliasing -ffunction-sections -fdata-sections -ffunction-sections -fdata-sections -O2 -O2 -pipe -march=pentium4 -mtune=pentium4 -Wno-error -w -isystem/usr/local/include -I/usr/local/include conftest.c 1>&5
configure:17324: checking for __cxa_demangle
configure:17355: clang++ -o conftest -O2 -pipe -march=pentium4 -mtune=pentium4 -fno-strict-aliasing -O2 -pipe -march=pentium4 -mtune=pentium4 -Wno-error -w -fno-exceptions -fno-strict-aliasing -fno-rtti -ffunction-sections -fdata-sections -fno-exceptions -std=gnu++0x -fno-rtti -ffunction-sections -fdata-sections -fno-exceptions -O2 -pipe -march=pentium4 -mtune=pentium4 -Wno-error -w -isystem/usr/local/include -I/usr/local/include -pthread -L/usr/local/lib -L/usr/local/lib -Wl,-z,origin -Wl,-rpath,\$$ORIGIN conftest.C -lm 1>&5
configure:17409: checking for unwind.h
configure:17419: clang-cpp -O2 -pipe -march=pentium4 -mtune=pentium4 -Wno-error -w -isystem/usr/local/include -I/usr/local/include conftest.c >/dev/null 2>conftest.out
configure:17415:10: fatal error: 'unwind.h' file not found
#include <unwind.h>
^
1 error generated.
configure: failed program was:
#line 17414 "configure"
#include "confdefs.h"
#include <unwind.h>
configure:17610: checking for gcc -pipe support
dummy-hello.c:2:39: warning: implicitly declaring C library function 'exit' with type 'void (int) __attribute__((noreturn))'
int main() { printf("Hello World\n"); exit(0); }
^
dummy-hello.c:2:39: note: please include the header <stdlib.h> or explicitly provide a declaration for 'exit'
1 warning generated.
configure:17632: clang -c -O2 -pipe -march=pentium4 -mtune=pentium4 -fno-strict-aliasing -fno-strict-aliasing -ffunction-sections -fdata-sections -ffunction-sections -fdata-sections -pipe -O2 -pipe -march=pentium4 -mtune=pentium4 -Wno-error -w -isystem/usr/local/include -I/usr/local/include conftest.c 1>&5
configure:17662: checking whether C compiler supports -fprofile-generate
configure:17671: clang -c -O2 -pipe -march=pentium4 -mtune=pentium4 -fno-strict-aliasing -fno-strict-aliasing -ffunction-sections -fdata-sections -ffunction-sections -fdata-sections -pipe -fprofile-generate -fprofile-correction -O2 -pipe -march=pentium4 -mtune=pentium4 -Wno-error -w -isystem/usr/local/include -I/usr/local/include conftest.c 1>&5
clang: warning: argument unused during compilation: '-fprofile-generate'
clang: warning: argument unused during compilation: '-fprofile-correction'
configure:17769: checking for correct temporary object destruction order
configure:17797: clang++ -o conftest -O2 -pipe -march=pentium4 -mtune=pentium4 -fno-strict-aliasing -O2 -pipe -march=pentium4 -mtune=pentium4 -Wno-error -w -fno-exceptions -fno-strict-aliasing -fno-rtti -ffunction-sections -fdata-sections -fno-exceptions -std=gnu++0x -fno-rtti -ffunction-sections -fdata-sections -fno-exceptions -pipe -O2 -pipe -march=pentium4 -mtune=pentium4 -Wno-error -w -isystem/usr/local/include -I/usr/local/include -pthread -L/usr/local/lib -L/usr/local/lib -Wl,-z,origin -Wl,-rpath,\$$ORIGIN conftest.C -lm 1>&5
configure:17818: checking for correct overload resolution with const and templates
configure:17853: clang++ -c -O2 -pipe -march=pentium4 -mtune=pentium4 -fno-strict-aliasing -O2 -pipe -march=pentium4 -mtune=pentium4 -Wno-error -w -fno-exceptions -fno-strict-aliasing -fno-rtti -ffunction-sections -fdata-sections -fno-exceptions -std=gnu++0x -fno-rtti -ffunction-sections -fdata-sections -fno-exceptions -pipe -Wall -Wpointer-arith -Woverloaded-virtual -Werror=return-type -Wtype-limits -Wempty-body -Werror=conversion-null -Wno-ctor-dtor-privacy -Wno-overlength-strings -Wno-invalid-offsetof -Wno-variadic-macros -Wno-c++0x-extensions -Wno-extended-offsetof -Wno-unknown-warning-option -Wno-return-type-c-linkage -Wno-mismatched-tags -Wno-unknown-warning-option -Wno-return-type-c-linkage -Wno-mismatched-tags -O2 -pipe -march=pentium4 -mtune=pentium4 -Wno-error -w -isystem/usr/local/include -I/usr/local/include conftest.C 1>&5
configure:18026: checking for glib-2.0 >= 1.3.7 gobject-2.0
configure:18033: checking GLIB_CFLAGS
configure:18038: checking GLIB_LIBS
configure:18099: checking for stdint.h
configure:18109: clang-cpp -O2 -pipe -march=pentium4 -mtune=pentium4 -Wno-error -w -isystem/usr/local/include -I/usr/local/include conftest.c >/dev/null 2>conftest.out
configure:18099: checking for inttypes.h
configure:18109: clang-cpp -O2 -pipe -march=pentium4 -mtune=pentium4 -Wno-error -w -isystem/usr/local/include -I/usr/local/include conftest.c >/dev/null 2>conftest.out
configure:18099: checking for sys/int_types.h
configure:18109: clang-cpp -O2 -pipe -march=pentium4 -mtune=pentium4 -Wno-error -w -isystem/usr/local/include -I/usr/local/include conftest.c >/dev/null 2>conftest.out
configure:18105:10: fatal error: 'sys/int_types.h' file not found
#include <sys/int_types.h>
^
1 error generated.
configure: failed program was:
#line 18104 "configure"
#include "confdefs.h"
#include <sys/int_types.h>
configure:18199: checking for cairo >= 1.10 pixman-1 freetype2 fontconfig
configure:18206: checking CAIRO_CFLAGS
configure:18211: checking CAIRO_LIBS
configure:18292: checking for cairo-xlib-xrender >= 1.10
configure:18299: checking CAIRO_XRENDER_CFLAGS
configure:18304: checking CAIRO_XRENDER_LIBS
configure:18912: clang -c -Wall -Wpointer-arith -Wdeclaration-after-statement -Werror=return-type -Wtype-limits -Wempty-body -Wno-unused -Wno-overlength-strings -O2 -pipe -march=pentium4 -mtune=pentium4 -fno-strict-aliasing -fno-strict-aliasing -ffunction-sections -fdata-sections -ffunction-sections -fdata-sections -pipe -I/usr/local/include -O2 -pipe -march=pentium4 -mtune=pentium4 -Wno-error -w -isystem/usr/local/include -I/usr/local/include conftest.c 1>&5
Stack dump:
0. Program arguments: /usr/bin/clang -cc1 -triple i386-unknown-freebsd9.0 -emit-obj -disable-free -main-file-name conftest.c -mrelocation-model static -mdisable-fp-elim -relaxed-aliasing -masm-verbose -mconstructor-aliases -target-cpu pentium4 -momit-leaf-frame-pointer -ffunction-sections -ffunction-sections -fdata-sections -fdata-sections -coverage-file conftest.o -resource-dir /usr/bin/../lib/clang/3.0 -isystem /usr/local/include -I /usr/local/include -I /usr/local/include -fmodule-cache-path /tmp/clang-module-cache -O2 -Wall -Wpointer-arith -Wdeclaration-after-statement -Werror=return-type -Wtype-limits -Wempty-body -Wno-unused -Wno-overlength-strings -Wno-error -w -ferror-limit 19 -fmessage-length 0 -fgnu-runtime -fobjc-runtime-has-arc -fobjc-runtime-has-weak -fobjc-fragile-abi -fdiagnostics-show-option -o conftest.o -x c conftest.c
1. <eof> parser at end of file
2. configure:18901:5: LLVM IR generation of declaration 'main'
3. configure:18901:5: Generating code for declaration 'main'
4. configure:18901:12: LLVM IR generation of compound statement ('{}')
5. configure:18904:49: LLVM IR generation of compound statement ('{}')
clang: error: unable to execute command: Illegal instruction: 4 (core dumped)
clang: error: clang frontend command failed due to signal 2 (use -v to see invocation)
clang: note: diagnostic msg: Please submit a bug report to http://llvm.org/bugs/ and include command line arguments and all diagnostic information.
clang: note: diagnostic msg: Preprocessed source(s) are located at:
clang: note: diagnostic msg: /tmp/conftest-3H80uZ.i
configure: failed program was:
#line 18894 "configure"
#include "confdefs.h"
#include <stdio.h>
#include <stdlib.h>
#include <X11/Xlib.h>
#include <X11/Intrinsic.h>
int main() {
Display *dpy = 0;
if ((dpy = XOpenDisplay(NULL)) == NULL) {
fprintf(stderr, ": can't open %s\n", XDisplayName(NULL));
exit(1);
}
; return 0; }
Want to link to this message? Use this URL: <https://mail-archive.FreeBSD.org/cgi/mid.cgi?CACGq7x0DAz5spTZ5EZDfjkJmoF7hs-Ly9tL0RhUc4eomXe=hTg>
