Skip site navigation (1)Skip section navigation (2)
Date:      Fri, 28 Oct 2016 18:42:29 +0000
From:      bugzilla-noreply@freebsd.org
To:        freebsd-ports-bugs@FreeBSD.org
Subject:   [Bug 213865] print/ghostscript9-agpl-base fails to build on arm64
Message-ID:  <bug-213865-13@https.bugs.freebsd.org/bugzilla/>

next in thread | raw e-mail | index | archive | help
https://bugs.freebsd.org/bugzilla/show_bug.cgi?id=3D213865

            Bug ID: 213865
           Summary: print/ghostscript9-agpl-base fails to build on arm64
           Product: Ports & Packages
           Version: Latest
          Hardware: Any
                OS: Any
            Status: New
          Severity: Affects Only Me
          Priority: ---
         Component: Individual Port(s)
          Assignee: doceng@FreeBSD.org
          Reporter: gjb@FreeBSD.org
            Blocks: 201763
             Flags: maintainer-feedback?(doceng@FreeBSD.org)
          Assignee: doceng@FreeBSD.org

Assertion failed: (isSimple() && "Expected a SimpleValueType!"), function
getSimpleVT, file
/usr/src/lib/clang/libllvmaarch64codegen/../../../contrib/llvm/include/llvm=
/CodeGen/ValueTypes.h,
line 222.
cc: error: unable to execute command: Abort trap (core dumped)
cc: error: clang frontend command failed due to signal (use -v to see
invocation)
FreeBSD clang version 3.8.0 (tags/RELEASE_380/final 262564) (based on LLVM
3.8.0)
Target: aarch64-unknown-freebsd12.0
Thread model: posix
InstalledDir: /usr/bin
cc: note: diagnostic msg: PLEASE submit a bug report to
https://bugs.freebsd.org/submit/ and include the crash backtrace, preproces=
sed
source, and associated run script.
cc: note: diagnostic msg:
********************

PLEASE ATTACH THE FOLLOWING FILES TO THE BUG REPORT:
Preprocessed source(s) and associated run script(s) are located at:
cc: note: diagnostic msg: /tmp/gdevcd8-751c5c.c
cc: note: diagnostic msg: /tmp/gdevcd8-751c5c.sh
cc: note: diagnostic msg:

********************
gmake[3]: *** [contrib/contrib.mak:205: soobj/gdevcd8.o] Error 254
gmake[3]: Leaving directory
'/wrkdirs/usr/ports/print/ghostscript9-agpl-base/work/ghostscript-9.16'
gmake[2]: *** [base/unix-dll.mak:134: so-subtarget] Error 2
gmake[2]: Leaving directory
'/wrkdirs/usr/ports/print/ghostscript9-agpl-base/work/ghostscript-9.16'
gmake[1]: *** [base/unix-dll.mak:120: so] Error 2
gmake[1]: Leaving directory
'/wrkdirs/usr/ports/print/ghostscript9-agpl-base/work/ghostscript-9.16'
*** Error code 1

Stop.
make: stopped in /usr/ports/print/ghostscript9-agpl-base


Referenced Bugs:

https://bugs.freebsd.org/bugzilla/show_bug.cgi?id=3D201763
[Bug 201763] Tracking bug for AArch64 port build failures
--=20
You are receiving this mail because:
You are the assignee for the bug.=



Want to link to this message? Use this URL: <https://mail-archive.FreeBSD.org/cgi/mid.cgi?bug-213865-13>