Skip site navigation (1)Skip section navigation (2)
Date:      Thu, 19 Jan 2023 18:22:09 +0000 (GMT)
From:      jenkins-admin@FreeBSD.org
To:        gbe@FreeBSD.org, dev-ci@FreeBSD.org
Cc:        jenkins-admin@FreeBSD.org
Subject:   FreeBSD-main-amd64-test - Build #22828 - Still Unstable
Message-ID:  <1145764604.8055.1674152530499@jenkins.ci.freebsd.org>
In-Reply-To: <1980470756.8049.1674144474159@jenkins.ci.freebsd.org>
References:  <1980470756.8049.1674144474159@jenkins.ci.freebsd.org>

next in thread | previous in thread | raw e-mail | index | archive | help
------=_Part_8054_1651912495.1674152530004
Content-Type: text/plain; charset=UTF-8
Content-Transfer-Encoding: 7bit

FreeBSD-main-amd64-test - Build #22828 (05187f2ffc79e5959762ab8ce7067b7b8a1cdfd9) - Still Unstable

Build information: https://ci.FreeBSD.org/job/FreeBSD-main-amd64-test/22828/
Full change log: https://ci.FreeBSD.org/job/FreeBSD-main-amd64-test/22828/changes
Full build log: https://ci.FreeBSD.org/job/FreeBSD-main-amd64-test/22828/console

Status explanation:
"Unstable" - some tests are suspected being broken by the following changes
"Still Unstable" - the failing test cases have not been fixed by these
                   following changes and this is a notification to note that
                   these changes have not been fully tested by the CI system

Change summaries:
(Those commits are likely but not certainly responsible)

e4b7980c5ca9c701242f3c395a042360db0ad7a7 by gbe:
ath(4): Fix a sysctl description and a typo in a comment

30985d19b00da3ea3ba808b57e5a46ce6403b8d7 by gbe:
rc.initdiskless: Fix a typo in a comment

7a184a41c6a31a1dcf82c2e35446f96dde78dbce by gbe:
bsnmpget.1: Fix a typo in the man page

74d2a3c16d74376f594162ee622ba470d631b386 by gbe:
cxgbetool(8): Fix common typos in sysctl descriptions

afc55510b1178ba94d2bdcef0eb666b10abcfc42 by gbe:
mountd(8): Fix a typo in a source code comment

72e709040f3691911c7b58d5a14b4d19b276f478 by gbe:
nfs: Fix a common typo in source code comments

05187f2ffc79e5959762ab8ce7067b7b8a1cdfd9 by gbe:
amd64: Fix a common typo in source code comments



The failed test cases:

7 tests failed.
FAILED:  sys.netpfil.common.dummynet.pf_queue

Error Message:
We failed prioritisation 1 times

FAILED:  lib.libc.time.mktime_test.timegm_epoch

Error Message:
/usr/src/contrib/netbsd-tests/lib/libc/time/t_mktime.c:98: Expected errno 0, got 84, in t == (time_t)0

FAILED:  sys.net.if_tun_test.235704

Error Message:
atf-check failed; see the output of the test for details

FAILED:  usr.sbin.etcupdate.preworld_test.main

Error Message:
Returned non-success exit status 1

FAILED:  sys.aio.aio_test.aio_socket_blocking_short_write

Error Message:
Test case body timed out

FAILED:  sys.aio.aio_test.aio_socket_blocking_short_write_vectored

Error Message:
Test case body timed out

FAILED:  sys.aio.aio_test.aio_socket_short_write_cancel

Error Message:
/usr/src/tests/sys/aio/aio_test.c:1396: aio_error(&iocb) == EINPROGRESS not met
------=_Part_8054_1651912495.1674152530004--



Want to link to this message? Use this URL: <https://mail-archive.FreeBSD.org/cgi/mid.cgi?1145764604.8055.1674152530499>