Skip site navigation (1)Skip section navigation (2)
Date:      Thu, 18 Jan 2018 09:48:28 GMT
From:      pkg-fallout@FreeBSD.org
To:        bsam@FreeBSD.org
Cc:        pkg-fallout@FreeBSD.org
Subject:   [package - head-amd64-default][graphics/iccexamin] Failed for icc-examin-0.56 in build
Message-ID:  <201801180948.w0I9mSSf057515@beefy12.nyi.freebsd.org>

next in thread | raw e-mail | index | archive | help
You are receiving this mail as a port that you maintain
is failing to build on the FreeBSD package build server.
Please investigate the failure and submit a PR to fix
build.

Maintainer:     bsam@FreeBSD.org
Last committer: amdmi3@FreeBSD.org
Ident:          $FreeBSD: head/graphics/iccexamin/Makefile 456620 2017-12-18 11:22:42Z amdmi3 $
Log URL:        http://beefy12.nyi.freebsd.org/data/head-amd64-default/p459306_s328104/logs/icc-examin-0.56.log
Build URL:      http://beefy12.nyi.freebsd.org/build.html?mastername=head-amd64-default&build=p459306_s328104
Log:

=>> Building graphics/iccexamin
build started at Thu Jan 18 09:47:38 UTC 2018
port directory: /usr/ports/graphics/iccexamin
package name: icc-examin-0.56
building for: FreeBSD head-amd64-default-job-20 12.0-CURRENT FreeBSD 12.0-CURRENT 1200056 amd64
maintained by: bsam@FreeBSD.org
Makefile ident:      $FreeBSD: head/graphics/iccexamin/Makefile 456620 2017-12-18 11:22:42Z amdmi3 $
Poudriere version: 3.2.4
Host OSVERSION: 1200054
Jail OSVERSION: 1200056
Job Id: 20




!!! Jail is newer than host. (Jail: 1200056, Host: 1200054) !!!
!!! This is not supported. !!!
!!! Host kernel must be same or newer than jail. !!!
!!! Expect build failures. !!!



---Begin Environment---
SHELL=/bin/csh
OSVERSION=1200056
UNAME_v=FreeBSD 12.0-CURRENT 1200056
UNAME_r=12.0-CURRENT
BLOCKSIZE=K
MAIL=/var/mail/root
STATUS=1
SAVED_TERM=
MASTERMNT=/usr/local/poudriere/data/.m/head-amd64-default/ref
PATH=/sbin:/bin:/usr/sbin:/usr/bin:/usr/local/sbin:/usr/local/bin:/root/bin
POUDRIERE_BUILD_TYPE=bulk
OLDPWD=/usr/local/poudriere/data/.m/head-amd64-default/ref/.p
P_PORTS_FEATURES=FLAVORS SELECTED_OPTIONS
PWD=/usr/local/poudriere/data/.m/head-amd64-default/ref/.p/pool
MASTERNAME=head-amd64-default
SCRIPTPREFIX=/usr/local/share/poudriere
USER=root
HOME=/root
P_PYTHON_MAJOR_VER=2
POUDRIERE_VERSION=3.2.4
SCRIPTPATH=/usr/local/share/poudriere/bulk.sh
LIBEXECPREFIX=/usr/local/libexec/poudriere
LOCALBASE=/usr/local
POUDRIEREPATH=/usr/local/bin/poudriere
---End Environment---

---Begin Poudriere Port Flags/Env---
PORT_FLAGS=
PKGENV=
FLAVOR=
DEPENDS_ARGS=
MAKE_ARGS=
---End Poudriere Port Flags/Env---

---Begin OPTIONS List---
---End OPTIONS List---

--MAINTAINER--
bsam@FreeBSD.org
--End MAINTAINER--

--CONFIGURE_ARGS--
--mandir=/usr/local/man --disable-openmp
--End CONFIGURE_ARGS--

--CONFIGURE_ENV--
PKG_CONFIG=pkgconf XDG_DATA_HOME=/wrkdirs/usr/ports/graphics/iccexamin/work  XDG_CONFIG_HOME=/wrkdirs/usr/ports/graphics/iccexamin/work  HOME=/wrkdirs/usr/ports/graphics/iccexamin/work TMPDIR="/tmp" PATH=/wrkdirs/usr/ports/graphics/iccexamin/work/.bin:/sbin:/bin:/usr/sbin:/usr/bin:/usr/local/sbin:/usr/local/bin:/root/bin SHELL=/bin/sh CONFIG_SHELL=/bin/sh
--End CONFIGURE_ENV--

--MAKE_ENV--
XDG_DATA_HOME=/wrkdirs/usr/ports/graphics/iccexamin/work  XDG_CONFIG_HOME=/wrkdirs/usr/ports/graphics/iccexamin/work  HOME=/wrkdirs/usr/ports/graphics/iccexamin/work TMPDIR="/tmp" PATH=/wrkdirs/usr/ports/graphics/iccexamin/work/.bin:/sbin:/bin:/usr/sbin:/usr/bin:/usr/local/sbin:/usr/local/bin:/root/bin NO_PIE=yes MK_DEBUG_FILES=no MK_KERNEL_SYMBOLS=no SHELL=/bin/sh NO_LINT=YES PREFIX=/usr/local  LOCALBASE=/usr/local  LIBDIR="/usr/lib"  CC="cc" CFLAGS="-O2 -pipe  -DLIBICONV_PLUG -fstack-protector -fno-strict-aliasing"  CPP="cpp" CPPFLAGS="-DLIBICONV_PLUG"  LDFLAGS=" -fstack-protector" LIBS=""  CXX="c++" CXXFLAGS="-O2 -pipe -DLIBICONV_PLUG -fstack-protector -fno-strict-aliasing  -DLIBICONV_PLUG"  MANPREFIX="/usr/local" BSD_INSTALL_PROGRAM="install  -s -m 555"  BSD_INSTALL_LIB="install  -s -m 0644"  BSD_INSTALL_SCRIPT="install  -m 555"  BSD_INSTALL_DATA="install  -m 0644"  BSD_INSTALL_MAN="install  -m 444"
--End MAKE_ENV--

--PLIST_SUB--
PORTDOCS="" PORTEXAMPLES="" GTK2_VERSION="2.10.0"  GTK3_VERSION="3.0.0" OSREL=12.0 PREFIX=%D LOCALBASE=/usr/local  RESETPREFIX=/usr/local LIB32DIR=lib DOCSDIR="share/doc/icc-examin"  EXAMPLESDIR="share/examples/icc-examin"  DATADIR="share/icc-examin"  WWWDIR="www/icc-examin"  ETCDIR="etc/icc-examin"
--End PLIST_SUB--

--SUB_LIST--
PREFIX=/usr/local LOCALBASE=/usr/local  DATADIR=/usr/local/share/icc-examin DOCSDIR=/usr/local/share/doc/icc-examin EXAMPLESDIR=/usr/local/share/examples/icc-examin  WWWDIR=/usr/local/www/icc-examin ETCDIR=/usr/local/etc/icc-examin
--End SUB_LIST--

---Begin make.conf---
USE_PACKAGE_DEPENDS=yes
BATCH=yes
WRKDIRPREFIX=/wrkdirs
PORTSDIR=/usr/ports
PACKAGES=/packages
DISTDIR=/distfiles
PACKAGE_BUILDING=yes
PACKAGE_BUILDING_FLAVORS=yes
#### /usr/local/etc/poudriere.d/make.conf ####
# XXX: We really need this but cannot use it while 'make checksum' does not
# try the next mirror on checksum failure.  It currently retries the same
# failed mirror and then fails rather then trying another.  It *does*
# try the next if the size is mismatched though.
#MASTER_SITE_FREEBSD=yes
# Build ALLOW_MAKE_JOBS_PACKAGES with 2 jobs
MAKE_JOBS_NUMBER=2
#### /usr/ports/Mk/Scripts/ports_env.sh ####
ARCH=amd64
CONFIGURE_MAX_CMD_LEN=262144
HAVE_COMPAT_IA32_KERN=YES
OPSYS=FreeBSD
OSREL=12.0
OSVERSION=1200056
PYTHONBASE=/usr/local
UID=0
_OSRELEASE=12.0-CURRENT
#### Misc Poudriere ####
GID=0
DISABLE_MAKE_JOBS=poudriere
---End make.conf---
--Resource limits--
cpu time               (seconds, -t)  unlimited
file size           (512-blocks, -f)  unlimited
data seg size           (kbytes, -d)  33554432
stack size              (kbytes, -s)  524288
core file size      (512-blocks, -c)  unlimited
max memory size         (kbytes, -m)  unlimited
locked memory           (kbytes, -l)  unlimited
max user processes              (-u)  89999
open files                      (-n)  1024
virtual mem size        (kbytes, -v)  unlimited
swap limit              (kbytes, -w)  unlimited
socket buffer size       (bytes, -b)  unlimited
pseudo-terminals                (-p)  unlimited
kqueues                         (-k)  unlimited
umtx shared locks               (-o)  unlimited
--End resource limits--
=======================<phase: check-sanity   >============================
===>  License GPLv2+ accepted by the user
===========================================================================
=======================<phase: pkg-depends    >============================
===>   icc-examin-0.56 depends on file: /usr/local/sbin/pkg - not found
===>   Installing existing package /packages/All/pkg-1.10.4.txz
[head-amd64-default-job-20] Installing pkg-1.10.4...
[head-amd64-default-job-20] Extracting pkg-1.10.4: .......... done
===>   icc-examin-0.56 depends on file: /usr/local/sbin/pkg - found
===>   Returning to build of icc-examin-0.56
===========================================================================
=======================<phase: fetch-depends  >============================
===========================================================================
=======================<phase: fetch          >============================
===>  License GPLv2+ accepted by the user
===> Fetching all distfiles required by icc-examin-0.56 for building
===========================================================================
=======================<phase: checksum       >============================
===>  License GPLv2+ accepted by the user
===> Fetching all distfiles required by icc-examin-0.56 for building
=> SHA256 Checksum OK for oyranos-cms-icc-examin-0.56_GH0.tar.gz.
===========================================================================
=======================<phase: extract-depends>============================
===========================================================================
=======================<phase: extract        >============================
===>  License GPLv2+ accepted by the user
===> Fetching all distfiles required by icc-examin-0.56 for building
===>  Extracting for icc-examin-0.56
=> SHA256 Checksum OK for oyranos-cms-icc-examin-0.56_GH0.tar.gz.
===========================================================================
=======================<phase: patch-depends  >============================
===========================================================================
=======================<phase: patch          >============================
===>  Patching for icc-examin-0.56
===>  Applying FreeBSD patches for icc-examin-0.56
===========================================================================
=======================<phase: build-depends  >============================
===>   icc-examin-0.56 depends on executable: update-desktop-database - not found
===>   Installing existing package /packages/All/desktop-file-utils-0.23.txz
[head-amd64-default-job-20] Installing desktop-file-utils-0.23...
[head-amd64-default-job-20] `-- Installing gettext-runtime-0.19.8.1_1...
[head-amd64-default-job-20] |   `-- Installing indexinfo-0.3.1...
[head-amd64-default-job-20] |   `-- Extracting indexinfo-0.3.1: .... done
[head-amd64-default-job-20] `-- Extracting gettext-runtime-0.19.8.1_1: .......... done
[head-amd64-default-job-20] `-- Installing glib-2.50.2_7,1...
[head-amd64-default-job-20] |   `-- Installing libffi-3.2.1_2...
[head-amd64-default-job-20] |   `-- Extracting libffi-3.2.1_2: .......... done
[head-amd64-default-job-20] |   `-- Installing libiconv-1.14_11...
[head-amd64-default-job-20] |   `-- Extracting libiconv-1.14_11: .......... done
[head-amd64-default-job-20] |   `-- Installing pcre-8.40_1...
[head-amd64-default-job-20] |   `-- Extracting pcre-8.40_1: .......... done
[head-amd64-default-job-20] |   `-- Installing perl5-5.24.3...
[head-amd64-default-job-20] |   `-- Extracting perl5-5.24.3: .......... done
[head-amd64-default-job-20] |   `-- Installing python27-2.7.14_1...
[head-amd64-default-job-20] |   | `-- Installing readline-7.0.3_1...
[head-amd64-default-job-20] |   | `-- Extracting readline-7.0.3_1: .......... done
[head-amd64-default-job-20] |   `-- Extracting python27-2.7.14_1: .......... done
[head-amd64-default-job-20] `-- Extracting glib-2.50.2_7,1: .......... done
No schema files found: doing nothing.
[head-amd64-default-job-20] Extracting desktop-file-utils-0.23: .......... done
Message from perl5-5.24.3:

The /usr/bin/perl symlink has been removed starting with Perl 5.20.
For shebangs, you should either use:

#!/usr/local/bin/perl

<snip>
===>   icc-examin-0.56 depends on shared library: libjpeg.so - found (/usr/local/lib/libjpeg.so)
===>   icc-examin-0.56 depends on shared library: libatk-1.0.so - found (/usr/local/lib/libatk-1.0.so)
===>   icc-examin-0.56 depends on shared library: libgdk_pixbuf-2.0.so - found (/usr/local/lib/libgdk_pixbuf-2.0.so)
===>   icc-examin-0.56 depends on shared library: libglib-2.0.so - found (/usr/local/lib/libglib-2.0.so)
===>   icc-examin-0.56 depends on shared library: libintl.so - found (/usr/local/lib/libintl.so)
===>   icc-examin-0.56 depends on shared library: libpango-1.0.so - found (/usr/local/lib/libpango-1.0.so)
===>   icc-examin-0.56 depends on shared library: libGLU.so - found (/usr/local/lib/libGLU.so)
===========================================================================
=======================<phase: configure      >============================
===>  Configuring for icc-examin-0.56
cat: /wrkdirs/usr/ports/graphics/iccexamin/work/icc-examin-0.56/.git/refs/heads/master: No such file or directory

################################################################
#                                                              #
        Welcome to ICC Examin Version 0.56 configurator
#                                                              #
#                       Configuration                          #

BSD FreeBSD             detected
64-bit build            detected
amd64 system             detected


libdl is available
libiconv is available
libintl is available
libc is available
libm is available
libpthread is available
Oyranos	0.9.6		detected
X CM 0.5.4              detected
X VidMode 2.3.1         detected
X Xinerama 1.1.3        detected
X Xrandr 1.5.1          detected
glu	9.0.0		detected
libXpm is available
libXext is available
libXinerama is available
libXxf86vm is available
libXrandr is available
libX11 is available
X11	1.6.5		detected
FTGL	2.1.3~rc5		detected
FONTCONFIG	2.12.1	detected
FLTK	utf-8 1.3.4	detected
LIBTIFF, Version 4.0.9
Copyright (c) 1988-1996 Sam Leffler
Copyright (c) 1991-1996 Silicon Graphics, Inc.
                        detected
Gettext                 detected
msgcat                  detected
translations available: cs de eo eu fr


generated icc-examin.spec from "icc-examin.spec.in"
prefix =                /usr/local

################################################################
#                       Configuration                          #
prefix          =       /usr/local
exec_prefix     =       /usr/local
bindir          =       /usr/local/bin
sbindir         =       /usr/local/sbin
libdir          =       /usr/local/lib
includedir      =       /usr/local/include
datadir         =       /usr/local/share
mandir          =       /usr/local/man
pixmapdir       =       /usr/local/share/pixmaps
desktopdir      =       /usr/local/share/applications
src_dir          =       /wrkdirs/usr/ports/graphics/iccexamin/work/icc-examin-0.56
CC              =       cc
CXX             =       c++
CFLAGS          =        -O2 -pipe  -DLIBICONV_PLUG -fstack-protector -fno-strict-aliasing 
CXXFLAGS        =        -O2 -pipe -DLIBICONV_PLUG -fstack-protector -fno-strict-aliasing  -DLIBICONV_PLUG 
LDFLAGS         =         -fstack-protector 
INCL            =       -I$(includedir) -I/usr/X11R6/include -I. -I/usr/include/g++ -I/usr/include
################################################################

preparing Makefile in ./
preparing Makefile in fl_i18n/
echo mache sauber clean ...
mache sauber clean ...
rm -f  fl_i18n_example.o fl_i18n.o fl_i18n_example  libfl_i18n.a
for ling in ; do  test -f po/${ling}.gmo  && rm -f po/${ling}.gmo;  done;
echo ... clean fertig
.. clean fertig
preparing Makefile in bsp/
echo clean bsp ...
clean bsp ...
rm -f bspAlloc.o bspCollide.o bspPartition.o bspTree.o bspUtility.o bspMemory.o   mainBsp.o bsp  libbsp.a
echo ... clean done
.. clean done
preparing ICC Examin.sh in ./
cat: /wrkdirs/usr/ports/graphics/iccexamin/work/icc-examin-0.56/ICC Examin.sh.in: No such file or directory
echo preparing dependency compilation ...
preparing dependency compilation ...
echo "COBJECTS_ISUP = 1" > cobjects
echo "#nicht editieren/dont edit - automatisch generiert" >> cobjects
echo "" >> cobjects
for i in icc_oyranos_extern.o flstring.o vsnprintf.o  ; do  echo "${i}:" >> cobjects;  echo "	echo Compiling ${i} ..." >> cobjects;  echo '	$(CC) -I./ -I$(SRCDIR) $(CFLAGS_) -c -o $*.o $(SRCDIR)/$*.c' >> cobjects;  echo "" >> cobjects;  done
for i in icc_main.o agviewer.o icc_cgats_filter.o icc_draw.o icc_examin.o icc_examin_farbraum.o icc_examin_io.o icc_examin_tagwahl.o icc_fenster.o icc_formeln.o icc_gamut.o icc_gl.o icc_helfer.o icc_info.o icc_kette.o icc_measurement.o icc_model_observer.o icc_oyranos.o icc_profile.o icc_profile_header.o icc_profile_tags.o icc_schnell.o icc_speicher.o icc_threads.o icc_thread_daten.o icc_ueber.o icc_utils.o icc_vrml.o icc_vrml_parser.o threads.o icc_helfer_fltk.o icc_helfer_x.o; do  echo "${i}:" >> cobjects;  echo "	echo Compiling ${i} ..." >> cobjects;  echo '	$(CXX) -I./ -I$(SRCDIR) $(CXXFLAGS_) -c -o $*.o $(SRCDIR)/$*.cpp' >> cobjects;  echo "" >> cobjects;  done
for i in icc_betrachter.o my_file_chooser.o my_file_chooser2.o my_fl_double_window.o Flmm/Flmm.o Flmm/Flmm_Message.o Flmm/Flmm_Tabs.o ; do  echo "${i}:" >> cobjects;  echo "	echo Compiling ${i} ..." >> cobjects;  echo '	$(CXX) -I./ -I$(SRCDIR) $(CXXFLAGS_) $(GETTEXT) -c -o $*.o $(SRCDIR)/$*.cxx' >> cobjects;  echo "" >> cobjects;  done
echo "Check for Dependencies ..."
Check for Dependencies ...
echo "MAKEDEPEND_ISUP = 1" > mkdepend
echo "#nicht editieren/dont edit - automatisch generiert" >> mkdepend
(for file in icc_oyranos_extern.c  flstring.c  vsnprintf.c  agviewer.cpp  icc_cgats_filter.cpp  icc_draw.cpp  icc_examin.cpp  icc_examin_farbraum.cpp  icc_examin_io.cpp  icc_examin_tagwahl.cpp  icc_fenster.cpp  icc_formeln.cpp  icc_gamut.cpp  icc_gl.cpp  icc_helfer.cpp  icc_info.cpp  icc_kette.cpp  icc_measurement.cpp  icc_model_observer.cpp  icc_oyranos.cpp  icc_profile.cpp  icc_profile_header.cpp  icc_profile_tags.cpp  icc_schnell.cpp  icc_speicher.cpp  icc_threads.cpp  icc_thread_daten.cpp  icc_ueber.cpp  icc_utils.cpp  icc_vrml.cpp  icc_vrml_parser.cpp  threads.cpp  icc_helfer_osx.cpp  icc_helfer_x.cpp  icc_helfer_fltk.cpp  Flmm/Flmm.cxx  Flmm/Flmm_Message.cxx  Flmm/Flmm_Tabs.cxx    icc_betrachter.cxx  my_file_chooser.cxx  my_file_chooser2.cxx  my_fl_double_window.cxx  icc_main.cpp  icc_cinepaint.cpp  icc_cinepaint_intern.cpp ; do  incl_src="${incl_src} /wrkdirs/usr/ports/graphics/iccexamin/work/icc-examin-0.56/${file}"; done;  cc -MM -I./ -I/wrkdirs/usr/ports/graphics/iccexamin/
 work/icc-examin-0.56 -I/usr/X11R6/include -I/usr/include -I/usr/local/include -D_THREAD_SAFE -pthread  -I/usr/local/include -I/usr/local/include -D_THREAD_SAFE -pthread -I/usr/local/include -D_THREAD_SAFE -pthread  -I/usr/local/include/oyranos  -I/usr/local/include -I/usr/local/include/freetype2  -pipe -fstack-protector -isystem /usr/local/include -fno-strict-aliasing -isystem /usr/local/include -fvisibility-inlines-hidden -I/usr/local/include -D_LARGEFILE_SOURCE -D_LARGEFILE64_SOURCE -D_THREAD_SAFE -D_REENTRANT -I/usr/local/include -I/usr/local/include/FTGL -I/usr/local/include/freetype2 -I/usr/local/include -I/usr/local/include/freetype2  -I/wrkdirs/usr/ports/graphics/iccexamin/work/icc-examin-0.56 -I/wrkdirs/usr/ports/graphics/iccexamin/work/icc-examin-0.56/Flmm -I/usr/local/include -I/usr/local/include/libdrm -D_THREAD_SAFE -pthread -I/usr/local/include -D_THREAD_SAFE -pthread  -I/usr/local/include ${incl_src} >> mkdepend)
/wrkdirs/usr/ports/graphics/iccexamin/work/icc-examin-0.56/icc_cgats_filter.cpp:816:27: error: invalid suffix on literal; C++11 requires a space between literal and identifier [-Wreserved-user-defined-literal]
          DBG_CGATS_S( "["j<<"]["<<k<<"] "<<messungen[messungen.size()-1].felder[j][k] );
                          ^
                           
1 error generated.
/wrkdirs/usr/ports/graphics/iccexamin/work/icc-examin-0.56/icc_examin.cpp:1033:41: error: invalid suffix on literal; C++11 requires a space between literal and identifier [-Wreserved-user-defined-literal]
    options_ = oyOptions_ForFilter( "//"OY_TYPE_STD"/icc_color", 0, 0 );
                                        ^
                                         
1 error generated.
In file included from /wrkdirs/usr/ports/graphics/iccexamin/work/icc-examin-0.56/icc_oyranos.cpp:43:
./oyranos_display_helpers.c:511:27: error: invalid suffix on literal; C++11 requires a space between literal and identifier [-Wreserved-user-defined-literal]
    oyOptions_Handle( "//"OY_TYPE_STD"/create_profile.icc",
                          ^
                           
/wrkdirs/usr/ports/graphics/iccexamin/work/icc-examin-0.56/icc_oyranos.cpp:651:34: error: invalid suffix on literal; C++11 requires a space between literal and identifier [-Wreserved-user-defined-literal]
                             "//"OY_TYPE_STD"/config/command",
                                 ^
                                  
/wrkdirs/usr/ports/graphics/iccexamin/work/icc-examin-0.56/icc_oyranos.cpp:1187:27: error: invalid suffix on literal; C++11 requires a space between literal and identifier [-Wreserved-user-defined-literal]
                      "//"OY_TYPE_STD"/proofing_profile",
                          ^
                           
/wrkdirs/usr/ports/graphics/iccexamin/work/icc-examin-0.56/icc_oyranos.cpp:1191:35: error: invalid suffix on literal; C++11 requires a space between literal and identifier [-Wreserved-user-defined-literal]
    error = oyOptions_Handle( "//"OY_TYPE_STD"/create_profile.icc",
                                  ^
                                   
/wrkdirs/usr/ports/graphics/iccexamin/work/icc-examin-0.56/icc_oyranos.cpp:1397:34: error: invalid suffix on literal; C++11 requires a space between literal and identifier [-Wreserved-user-defined-literal]
                             "//"OY_TYPE_STD"/config/command",
                                 ^
                                  
/wrkdirs/usr/ports/graphics/iccexamin/work/icc-examin-0.56/icc_oyranos.cpp:1400:24: error: invalid suffix on literal; C++11 requires a space between literal and identifier [-Wreserved-user-defined-literal]
                   "//"OY_TYPE_STD"/config/icc_profile.x_color_region_target",
                       ^
                        
/wrkdirs/usr/ports/graphics/iccexamin/work/icc-examin-0.56/icc_oyranos.cpp:1656:33: error: invalid suffix on literal; C++11 requires a space between literal and identifier [-Wreserved-user-defined-literal]
  error = oyOptions_Handle( "//"OY_TYPE_STD"/set_xcm_region",
                                ^
                                 
/wrkdirs/usr/ports/graphics/iccexamin/work/icc-examin-0.56/icc_oyranos.cpp:1712:27: error: invalid suffix on literal; C++11 requires a space between literal and identifier [-Wreserved-user-defined-literal]
    oyOptions_Handle( "//"OY_TYPE_STD"/create_profile.icc",
                          ^
                           
8 errors generated.
/wrkdirs/usr/ports/graphics/iccexamin/work/icc-examin-0.56/icc_ueber.cpp:32:10: fatal error: 'config.log.h' file not found
#include "config.log.h"
         ^~~~~~~~~~~~~~
1 error generated.
/wrkdirs/usr/ports/graphics/iccexamin/work/icc-examin-0.56/icc_cinepaint.cpp:66:10: fatal error: 'libgimp/gimp.h' file not found
#include <libgimp/gimp.h>
         ^~~~~~~~~~~~~~~~
1 error generated.
*** Error code 1 (ignored)
===========================================================================
=======================<phase: build          >============================
===>  Building for icc-examin-0.56
echo Compiling icc_oyranos_extern.o ...
Compiling icc_oyranos_extern.o ...
cc -I./ -I/wrkdirs/usr/ports/graphics/iccexamin/work/icc-examin-0.56 -L. -fPIC -O2 -pipe  -DLIBICONV_PLUG -fstack-protector -fno-strict-aliasing  -I/usr/local/include -I/usr/X11R6/include -I. -I/usr/include/g++ -I/usr/include     -c -o icc_oyranos_extern.o /wrkdirs/usr/ports/graphics/iccexamin/work/icc-examin-0.56/icc_oyranos_extern.c
cc: warning: argument unused during compilation: '-L.' [-Wunused-command-line-argument]
echo Compiling flstring.o ...
Compiling flstring.o ...
cc -I./ -I/wrkdirs/usr/ports/graphics/iccexamin/work/icc-examin-0.56 -L. -fPIC -O2 -pipe  -DLIBICONV_PLUG -fstack-protector -fno-strict-aliasing  -I/usr/local/include -I/usr/X11R6/include -I. -I/usr/include/g++ -I/usr/include     -c -o flstring.o /wrkdirs/usr/ports/graphics/iccexamin/work/icc-examin-0.56/flstring.c
cc: warning: argument unused during compilation: '-L.' [-Wunused-command-line-argument]
echo Compiling vsnprintf.o ...
Compiling vsnprintf.o ...
cc -I./ -I/wrkdirs/usr/ports/graphics/iccexamin/work/icc-examin-0.56 -L. -fPIC -O2 -pipe  -DLIBICONV_PLUG -fstack-protector -fno-strict-aliasing  -I/usr/local/include -I/usr/X11R6/include -I. -I/usr/include/g++ -I/usr/include     -c -o vsnprintf.o /wrkdirs/usr/ports/graphics/iccexamin/work/icc-examin-0.56/vsnprintf.c
cc: warning: argument unused during compilation: '-L.' [-Wunused-command-line-argument]
echo Compiling agviewer.o ...
Compiling agviewer.o ...
c++ -I./ -I/wrkdirs/usr/ports/graphics/iccexamin/work/icc-examin-0.56 -L. -fPIC -O2 -pipe -DLIBICONV_PLUG -fstack-protector -fno-strict-aliasing  -DLIBICONV_PLUG  -I/usr/local/include -I/usr/X11R6/include -I. -I/usr/include/g++ -I/usr/include    -I/usr/X11R6/include -I/usr/include -I/usr/local/include -D_THREAD_SAFE -pthread  -I/usr/local/include -I/usr/local/include -D_THREAD_SAFE -pthread -I/usr/local/include -D_THREAD_SAFE -pthread  -I/usr/local/include/oyranos  -I/usr/local/include -I/usr/local/include/freetype2  -pipe -fstack-protector -isystem /usr/local/include -fno-strict-aliasing -isystem /usr/local/include -fvisibility-inlines-hidden -I/usr/local/include -D_LARGEFILE_SOURCE -D_LARGEFILE64_SOURCE -D_THREAD_SAFE -D_REENTRANT -I/usr/local/include -I/usr/local/include/FTGL -I/usr/local/include/freetype2 -I/usr/local/include -I/usr/local/include/freetype2  -I/wrkdirs/usr/ports/graphics/iccexamin/work/icc-examin-0.56 -I/wrkdirs/usr/ports/graphics/iccexamin/work/icc-examin-0.56/Fl
 mm -I/usr/local/include -I/usr/local/include/libdrm -D_THREAD_SAFE -pthread -I/usr/local/include -D_THREAD_SAFE -pthread  -I/usr/local/include  -c -o agviewer.o /wrkdirs/usr/ports/graphics/iccexamin/work/icc-examin-0.56/agviewer.cpp
c++: warning: argument unused during compilation: '-L.' [-Wunused-command-line-argument]
/wrkdirs/usr/ports/graphics/iccexamin/work/icc-examin-0.56/agviewer.cpp:222:13: warning: assigning field to itself [-Wself-assign-field]
      EyeAz =  EyeAz;
            ^
1 warning generated.
echo Compiling icc_cgats_filter.o ...
Compiling icc_cgats_filter.o ...
c++ -I./ -I/wrkdirs/usr/ports/graphics/iccexamin/work/icc-examin-0.56 -L. -fPIC -O2 -pipe -DLIBICONV_PLUG -fstack-protector -fno-strict-aliasing  -DLIBICONV_PLUG  -I/usr/local/include -I/usr/X11R6/include -I. -I/usr/include/g++ -I/usr/include    -I/usr/X11R6/include -I/usr/include -I/usr/local/include -D_THREAD_SAFE -pthread  -I/usr/local/include -I/usr/local/include -D_THREAD_SAFE -pthread -I/usr/local/include -D_THREAD_SAFE -pthread  -I/usr/local/include/oyranos  -I/usr/local/include -I/usr/local/include/freetype2  -pipe -fstack-protector -isystem /usr/local/include -fno-strict-aliasing -isystem /usr/local/include -fvisibility-inlines-hidden -I/usr/local/include -D_LARGEFILE_SOURCE -D_LARGEFILE64_SOURCE -D_THREAD_SAFE -D_REENTRANT -I/usr/local/include -I/usr/local/include/FTGL -I/usr/local/include/freetype2 -I/usr/local/include -I/usr/local/include/freetype2  -I/wrkdirs/usr/ports/graphics/iccexamin/work/icc-examin-0.56 -I/wrkdirs/usr/ports/graphics/iccexamin/work/icc-examin-0.56/Fl
 mm -I/usr/local/include -I/usr/local/include/libdrm -D_THREAD_SAFE -pthread -I/usr/local/include -D_THREAD_SAFE -pthread  -I/usr/local/include  -c -o icc_cgats_filter.o /wrkdirs/usr/ports/graphics/iccexamin/work/icc-examin-0.56/icc_cgats_filter.cpp
c++: warning: argument unused during compilation: '-L.' [-Wunused-command-line-argument]
/wrkdirs/usr/ports/graphics/iccexamin/work/icc-examin-0.56/icc_cgats_filter.cpp:816:27: error: invalid suffix on literal; C++11 requires a space between literal and identifier [-Wreserved-user-defined-literal]
          DBG_CGATS_S( "["j<<"]["<<k<<"] "<<messungen[messungen.size()-1].felder[j][k] );
                          ^
                           
1 error generated.
*** Error code 1

Stop.
make[1]: stopped in /wrkdirs/usr/ports/graphics/iccexamin/work/icc-examin-0.56
*** Error code 1

Stop.
make: stopped in /usr/ports/graphics/iccexamin



Want to link to this message? Use this URL: <https://mail-archive.FreeBSD.org/cgi/mid.cgi?201801180948.w0I9mSSf057515>