Skip site navigation (1)Skip section navigation (2)
Date:      Sun, 9 Jun 2024 16:00:36 +0300
From:      Odhiambo Washington <odhiambo@gmail.com>
To:        questions <questions@freebsd.org>
Subject:   /lang/rust - fatal error: 'float. h' file not found
Message-ID:  <CAAdA2WP9H3zBLrB_AaJ_mKatxyVrbN37=7VEwFXcwn8YDk2ZaQ@mail.gmail.com>

next in thread | raw e-mail | index | archive | help

[-- Attachment #1 --]
FreeBSD 14.1-RELEASE here.

Upgrading of security/py-cryptography pulls in lang/rust which fails to
install successfully because float.h is not found. But actually float.h is
there.
Anyone else seeing this?


=> SHA256 Checksum OK for rust/crates/windows_x86_64_msvc-0.48.5.crate.
===>  Moving crates to
/usr/ports/security/py-cryptography/work-py311/cryptography-42.0.8/cargo-crates
===>  Patching for py311-cryptography-42.0.8,1
===>   py311-cryptography-42.0.8,1 depends on package: py311-cffi>=1.12 -
found
===>   py311-cryptography-42.0.8,1 depends on package:
py311-setuptools>=61.0.0 - found
===>   py311-cryptography-42.0.8,1 depends on package:
py311-setuptools-rust>=1.7.0 - found
===>   py311-cryptography-42.0.8,1 depends on package: py311-wheel>=0 -
found
===>   py311-cryptography-42.0.8,1 depends on package: rust>=1.78.0 - not
found
===>  License APACHE20 MIT accepted by the user
===>   rust-1.78.0 depends on file: /usr/local/sbin/pkg - found
=> rustc-1.78.0-src.tar.xz doesn't seem to exist in
/usr/ports/distfiles/rust.
=> Attempting to fetch
https://static.rust-lang.org/dist/rustc-1.78.0-src.tar.xz
rustc-1.78.0-src.tar.xz                        25% of  151 MB 2317 kBps
01m28s

```
 cargo:rerun-if-env-changed=CFLAGS_wasm32_unknown_unknown
  CFLAGS_wasm32_unknown_unknown = Some("-ffunction-sections -fdata-sections
-fPIC --target=wasm32-unknown-unknown -pipe -fstack-protector-strong
-fno-strict-aliasing
-fdebug-prefix-map=/usr/ports/lang/rust/work/rustc-1.78.0-src=/rustc/9b00956e56009bab2aa15d7bff10916599e3d6d6")
  cargo:rerun-if-env-changed=CC_ENABLE_DEBUG_OUTPUT
  cargo:warning=In file included from
/usr/ports/lang/rust/work/rustc-1.78.0-src/src/llvm-project/compiler-rt/lib/builtins/absvdi2.c:13:

cargo:warning=/usr/ports/lang/rust/work/rustc-1.78.0-src/src/llvm-project/compiler-rt/lib/builtins/int_lib.h:92:10:
fatal error: 'float. h' file not found
  cargo:warning=   92 | #include <float.h>
  cargo:warning=      |          ^~~~~~~~~
  cargo:warning=1 error generated.

  --- stderr


  error occurred: Command "clang" "-O3" "-ffunction-sections"
"-fdata-sections" "-fPIC" "-ffunction-sections" "-fdata-sections" "-fPIC"
"--target=wasm32-unknown-unknown" "-pipe" "-fstack-protector-strong"
"-fno-strict-aliasing"
"-fdebug-prefix-map=/usr/ports/lang/rust/work/rustc-1.78.0-src=/rustc/9b00956e56009bab2aa15d7bff10916599e3d6d6"
"-fno-builtin" "-fvisibility=hidden" "-ffreestanding" "-DVISIBILITY_HIDDEN"
"-o"
"/usr/ports/lang/rust/work/_build/x86_64-unknown-freebsd/stage2-std/wasm32-unknown-unknown/release/build/compiler_builtins-54e9c282fe860763/out/00d83b8a602ca115-absvdi2.o"
"-c"
"/usr/ports/lang/rust/work/rustc-1.78.0-src/src/llvm-project/compiler-rt/lib/builtins/absvdi2.c"
with args "clang" did not execute successfully (status code exit status: 1).


warning: build failed, waiting for other jobs to finish...
command did not execute successfully: cd
"/usr/ports/lang/rust/work/rustc-1.78.0-src" && env -u MAKEFLAGS -u MFLAGS
AR_wasm32_unknown_unknown="ar" CARGO_INCREMENTAL="0"
CARGO_PROFILE_RELEASE_DEBUG="0"
CARGO_PROFILE_RELEASE_DEBUG_ASSERTIONS="false"
CARGO_PROFILE_RELEASE_OVERFLOW_CHECKS="false"
CARGO_PROFILE_RELEASE_STRIP="false"
CARGO_TARGET_DIR="/usr/ports/lang/rust/work/_build/x86_64-unknown-freebsd/stage2-std"
CARGO_TARGET_WASM32_UNKNOWN_UNKNOWN_LINKER="clang"
CC_wasm32_unknown_unknown="clang"
CFG_COMPILER_BUILD_TRIPLE="x86_64-unknown-freebsd"
CFG_COMPILER_HOST_TRIPLE="wasm32-unknown-unknown"
CFG_DISABLE_UNSTABLE_FEATURES="1" CFG_RELEASE_CHANNEL="stable"
CFG_VIRTUAL_RUST_SOURCE_BASE_DIR="/rustc/9b00956e56009bab2aa15d7bff10916599e3d6d6"
CFLAGS_wasm32_unknown_unknown="-ffunction-sections -fdata-sections -fPIC
--target=wasm32-unknown-unknown -pipe -fstack-protector-strong
-fno-strict-aliasing
-fdebug-prefix-map=/usr/ports/lang/rust/work/rustc-1.78.0-src=/rustc/9b00956e56009bab2aa15d7bff10916599e3d6d6"
CXXFLAGS_wasm32_unknown_unknown="-ffunction-sections -fdata-sections -fPIC
--target=wasm32-unknown-unknown -pipe -fstack-protector-strong
-fno-strict-aliasing
-fdebug-prefix-map=/usr/ports/lang/rust/work/rustc-1.78.0-src=/rustc/9b00956e56009bab2aa15d7bff10916599e3d6d6"
CXX_wasm32_unknown_unknown="clang++" LIBC_CHECK_CFG="1"
RANLIB_wasm32_unknown_unknown="ar s"
REAL_LIBRARY_PATH_VAR="LD_LIBRARY_PATH"
RUSTBUILD_NATIVE_DIR="/usr/ports/lang/rust/work/_build/wasm32-unknown-unknown/native"
RUSTC="/usr/ports/lang/rust/work/_build/bootstrap/debug/rustc"
RUSTC_BOOTSTRAP="1" RUSTC_BREAK_ON_ICE="1"
RUSTC_CARGO_REGISTRY_SRC_TO_REMAP="/usr/ports/lang/rust/work/rustc-1.78.0-src/vendor=/rust/deps"
RUSTC_DEBUGINFO_MAP="/usr/ports/lang/rust/work/rustc-1.78.0-src=/rustc/9b00956e56009bab2aa15d7bff10916599e3d6d6"
RUSTC_ERROR_METADATA_DST="/usr/ports/lang/rust/work/_build/tmp/extended-error-metadata"
RUSTC_FORCE_UNSTABLE="1" RUSTC_HOST_FLAGS="-Zunstable-options
--check-cfg=cfg(bootstrap) -Clinker=clang" RUSTC_INSTALL_BINDIR="bin"
RUSTC_LIBDIR="/usr/ports/lang/rust/work/_build/x86_64-unknown-freebsd/stage2/lib"
RUSTC_LINT_FLAGS="-Wrust_2018_idioms -Wunused_lifetimes"
RUSTC_REAL="/usr/ports/lang/rust/work/_build/x86_64-unknown-freebsd/stage2/bin/rustc"
RUSTC_SNAPSHOT="/usr/ports/lang/rust/work/bootstrap/bin/rustc"
RUSTC_SNAPSHOT_LIBDIR="/usr/ports/lang/rust/work/bootstrap/lib"
RUSTC_STAGE="2"
RUSTC_SYSROOT="/usr/ports/lang/rust/work/_build/x86_64-unknown-freebsd/stage2"
RUSTC_VERBOSE="2"
RUSTC_WRAPPER="/usr/ports/lang/rust/work/_build/bootstrap/debug/rustc"
RUSTDOC="/usr/ports/lang/rust/work/_build/bootstrap/debug/rustdoc"
RUSTDOCFLAGS="-Csymbol-mangling-version=legacy -Zunstable-options
--check-cfg=cfg(feature,values(any())) -Zunstable-options
--check-cfg=cfg(bootstrap) --check-cfg=cfg(stdarch_intel_sde)
--check-cfg=cfg(no_fp_fmt_parse) --check-cfg=cfg(no_global_oom_handling)
--check-cfg=cfg(no_rc) --check-cfg=cfg(no_sync) --check-cfg=cfg(netbsd10)
--check-cfg=cfg(backtrace_in_libstd)
--check-cfg=cfg(target_env,values(\"libnx\",\"p2\"))
--check-cfg=cfg(target_arch,values(\"arm64ec\",\"spirv\",\"nvptx\",\"xtensa\"))
-Wrustdoc::invalid_codeblock_attributes --crate-version
1.78.0\t(9b00956e5\t2024-04-29)\t(built\tfrom\ta\tsource\ttarball)
-Clinker=clang -Zcrate-attr=doc(html_root_url=\"
https://doc.rust-lang.org/1.78.0/\") -Zcrate-attr=warn(rust_2018_idioms)"
RUSTDOC_REAL="/path/to/nowhere/rustdoc/not/required"
RUSTFLAGS="-Csymbol-mangling-version=legacy -Zunstable-options
--check-cfg=cfg(feature,values(any())) -Zunstable-options
--check-cfg=cfg(bootstrap) --check-cfg=cfg(stdarch_intel_sde)
--check-cfg=cfg(no_fp_fmt_parse) --check-cfg=cfg(no_global_oom_handling)
--check-cfg=cfg(no_rc) --check-cfg=cfg(no_sync) --check-cfg=cfg(netbsd10)
--check-cfg=cfg(backtrace_in_libstd)
--check-cfg=cfg(target_env,values(\"libnx\",\"p2\"))
--check-cfg=cfg(target_arch,values(\"arm64ec\",\"spirv\",\"nvptx\",\"xtensa\"))
-Zmacro-backtrace -Zunstable-options -Csplit-debuginfo=off -Cprefer-dynamic
-Zinline-mir -Cembed-bitcode=yes -Zcrate-attr=doc(html_root_url=\"
https://doc.rust-lang.org/1.78.0/\")"
RUST_COMPILER_RT_ROOT="/usr/ports/lang/rust/work/rustc-1.78.0-src/src/llvm-project/compiler-rt"
RUST_TEST_THREADS="32" WINAPI_NO_BUNDLED_LIBRARIES="1"
__CARGO_DEFAULT_LIB_METADATA="stablestd"
"/usr/ports/lang/rust/work/bootstrap/bin/cargo" "build" "--target"
"wasm32-unknown-unknown" "--release" "-Zcheck-cfg" "-Zbinary-dep-depinfo"
"-j" "32" "-v" "-v" "--frozen" "--features" " panic-unwind backtrace
compiler-builtins-c" "--manifest-path"
"/usr/ports/lang/rust/work/rustc-1.78.0-src/library/sysroot/Cargo.toml"
"--message-format" "json-render-diagnostics"
expected success, got: exit status: 101
Traceback (most recent call last):
  File "/usr/ports/lang/rust/work/rustc-1.78.0-src/x.py", line 50, in
<module>
    bootstrap.main()
  File
"/usr/ports/lang/rust/work/rustc-1.78.0-src/src/bootstrap/bootstrap.py",
line 1164, in main
    bootstrap(args)
  File
"/usr/ports/lang/rust/work/rustc-1.78.0-src/src/bootstrap/bootstrap.py",
line 1140, in bootstrap
    run(args, env=env, verbose=build.verbose, is_bootstrap=True)
  File
"/usr/ports/lang/rust/work/rustc-1.78.0-src/src/bootstrap/bootstrap.py",
line 187, in run
    raise RuntimeError(err)
RuntimeError: failed to run:
/usr/ports/lang/rust/work/_build/bootstrap/debug/bootstrap dist --jobs=32
*** Error code 1

Stop.
make[1]: stopped in /usr/ports/lang/rust
*** Error code 1

Stop.
make: stopped in /usr/ports/security/py-cryptography
```


-- 
Best regards,
Odhiambo WASHINGTON,
Nairobi,KE
+254 7 3200 0004/+254 7 2274 3223
 In an Internet failure case, the #1 suspect is a constant: DNS.
"Oh, the cruft.", egrep -v '^$|^.*#' ¯\_(ツ)_/¯ :-)
[How to ask smart questions:
http://www.catb.org/~esr/faqs/smart-questions.html]

[-- Attachment #2 --]
<div dir="ltr">FreeBSD 14.1-RELEASE here.<div><br></div><div>Upgrading of security/py-cryptography pulls in lang/rust which fails to install successfully because float.h is not found. But actually float.h is there.</div><div>Anyone else seeing this?</div><div><br></div><div><br></div><div>=&gt; SHA256 Checksum OK for rust/crates/windows_x86_64_msvc-0.48.5.crate.<br>===&gt;  Moving crates to /usr/ports/security/py-cryptography/work-py311/cryptography-42.0.8/cargo-crates<br>===&gt;  Patching for py311-cryptography-42.0.8,1<br>===&gt;   py311-cryptography-42.0.8,1 depends on package: py311-cffi&gt;=1.12 - found<br>===&gt;   py311-cryptography-42.0.8,1 depends on package: py311-setuptools&gt;=61.0.0 - found<br>===&gt;   py311-cryptography-42.0.8,1 depends on package: py311-setuptools-rust&gt;=1.7.0 - found<br>===&gt;   py311-cryptography-42.0.8,1 depends on package: py311-wheel&gt;=0 - found<br>===&gt;   py311-cryptography-42.0.8,1 depends on package: rust&gt;=1.78.0 - not found<br>===&gt;  License APACHE20 MIT accepted by the user<br>===&gt;   rust-1.78.0 depends on file: /usr/local/sbin/pkg - found<br>=&gt; rustc-1.78.0-src.tar.xz doesn&#39;t seem to exist in /usr/ports/distfiles/rust.<br>=&gt; Attempting to fetch <a href="https://static.rust-lang.org/dist/rustc-1.78.0-src.tar.xz" target="_blank">https://static.rust-lang.org/dist/rustc-1.78.0-src.tar.xz</a><br>rustc-1.78.0-src.tar.xz                        25% of  151 MB 2317 kBps 01m28s<br><div><br></div><div>```</div><div> cargo:rerun-if-env-changed=CFLAGS_wasm32_unknown_unknown<br>  CFLAGS_wasm32_unknown_unknown = Some(&quot;-ffunction-sections -fdata-sections -fPIC --target=wasm32-unknown-unknown -pipe -fstack-protector-strong -fno-strict-aliasing -fdebug-prefix-map=/usr/ports/lang/rust/work/rustc-1.78.0-src=/rustc/9b00956e56009bab2aa15d7bff10916599e3d6d6&quot;)<br>  cargo:rerun-if-env-changed=CC_ENABLE_DEBUG_OUTPUT<br>  cargo:warning=In file included from /usr/ports/lang/rust/work/rustc-1.78.0-src/src/llvm-project/compiler-rt/lib/builtins/absvdi2.c:13:<br>  cargo:warning=/usr/ports/lang/rust/work/rustc-1.78.0-src/src/llvm-project/compiler-rt/lib/builtins/int_lib.h:92:10: fatal error: &#39;float. h&#39; file not found<br>  cargo:warning=   92 | #include &lt;float.h&gt;<br>  cargo:warning=      |          ^~~~~~~~~<br>  cargo:warning=1 error generated.<br><br>  --- stderr<br><br><br>  error occurred: Command &quot;clang&quot; &quot;-O3&quot; &quot;-ffunction-sections&quot; &quot;-fdata-sections&quot; &quot;-fPIC&quot; &quot;-ffunction-sections&quot; &quot;-fdata-sections&quot; &quot;-fPIC&quot; &quot;--target=wasm32-unknown-unknown&quot; &quot;-pipe&quot; &quot;-fstack-protector-strong&quot; &quot;-fno-strict-aliasing&quot; &quot;-fdebug-prefix-map=/usr/ports/lang/rust/work/rustc-1.78.0-src=/rustc/9b00956e56009bab2aa15d7bff10916599e3d6d6&quot; &quot;-fno-builtin&quot; &quot;-fvisibility=hidden&quot; &quot;-ffreestanding&quot; &quot;-DVISIBILITY_HIDDEN&quot; &quot;-o&quot; &quot;/usr/ports/lang/rust/work/_build/x86_64-unknown-freebsd/stage2-std/wasm32-unknown-unknown/release/build/compiler_builtins-54e9c282fe860763/out/00d83b8a602ca115-absvdi2.o&quot; &quot;-c&quot; &quot;/usr/ports/lang/rust/work/rustc-1.78.0-src/src/llvm-project/compiler-rt/lib/builtins/absvdi2.c&quot; with args &quot;clang&quot; did not execute successfully (status code exit status: 1).<br><br><br>warning: build failed, waiting for other jobs to finish...<br>command did not execute successfully: cd &quot;/usr/ports/lang/rust/work/rustc-1.78.0-src&quot; &amp;&amp; env -u MAKEFLAGS -u MFLAGS AR_wasm32_unknown_unknown=&quot;ar&quot; CARGO_INCREMENTAL=&quot;0&quot; CARGO_PROFILE_RELEASE_DEBUG=&quot;0&quot; CARGO_PROFILE_RELEASE_DEBUG_ASSERTIONS=&quot;false&quot; CARGO_PROFILE_RELEASE_OVERFLOW_CHECKS=&quot;false&quot; CARGO_PROFILE_RELEASE_STRIP=&quot;false&quot; CARGO_TARGET_DIR=&quot;/usr/ports/lang/rust/work/_build/x86_64-unknown-freebsd/stage2-std&quot; CARGO_TARGET_WASM32_UNKNOWN_UNKNOWN_LINKER=&quot;clang&quot; CC_wasm32_unknown_unknown=&quot;clang&quot; CFG_COMPILER_BUILD_TRIPLE=&quot;x86_64-unknown-freebsd&quot; CFG_COMPILER_HOST_TRIPLE=&quot;wasm32-unknown-unknown&quot; CFG_DISABLE_UNSTABLE_FEATURES=&quot;1&quot; CFG_RELEASE_CHANNEL=&quot;stable&quot; CFG_VIRTUAL_RUST_SOURCE_BASE_DIR=&quot;/rustc/9b00956e56009bab2aa15d7bff10916599e3d6d6&quot; CFLAGS_wasm32_unknown_unknown=&quot;-ffunction-sections -fdata-sections -fPIC --target=wasm32-unknown-unknown -pipe -fstack-protector-strong -fno-strict-aliasing -fdebug-prefix-map=/usr/ports/lang/rust/work/rustc-1.78.0-src=/rustc/9b00956e56009bab2aa15d7bff10916599e3d6d6&quot; CXXFLAGS_wasm32_unknown_unknown=&quot;-ffunction-sections -fdata-sections -fPIC --target=wasm32-unknown-unknown -pipe -fstack-protector-strong -fno-strict-aliasing -fdebug-prefix-map=/usr/ports/lang/rust/work/rustc-1.78.0-src=/rustc/9b00956e56009bab2aa15d7bff10916599e3d6d6&quot; CXX_wasm32_unknown_unknown=&quot;clang++&quot; LIBC_CHECK_CFG=&quot;1&quot; RANLIB_wasm32_unknown_unknown=&quot;ar s&quot; REAL_LIBRARY_PATH_VAR=&quot;LD_LIBRARY_PATH&quot; RUSTBUILD_NATIVE_DIR=&quot;/usr/ports/lang/rust/work/_build/wasm32-unknown-unknown/native&quot; RUSTC=&quot;/usr/ports/lang/rust/work/_build/bootstrap/debug/rustc&quot; RUSTC_BOOTSTRAP=&quot;1&quot; RUSTC_BREAK_ON_ICE=&quot;1&quot; RUSTC_CARGO_REGISTRY_SRC_TO_REMAP=&quot;/usr/ports/lang/rust/work/rustc-1.78.0-src/vendor=/rust/deps&quot; RUSTC_DEBUGINFO_MAP=&quot;/usr/ports/lang/rust/work/rustc-1.78.0-src=/rustc/9b00956e56009bab2aa15d7bff10916599e3d6d6&quot; RUSTC_ERROR_METADATA_DST=&quot;/usr/ports/lang/rust/work/_build/tmp/extended-error-metadata&quot; RUSTC_FORCE_UNSTABLE=&quot;1&quot; RUSTC_HOST_FLAGS=&quot;-Zunstable-options --check-cfg=cfg(bootstrap) -Clinker=clang&quot; RUSTC_INSTALL_BINDIR=&quot;bin&quot; RUSTC_LIBDIR=&quot;/usr/ports/lang/rust/work/_build/x86_64-unknown-freebsd/stage2/lib&quot; RUSTC_LINT_FLAGS=&quot;-Wrust_2018_idioms -Wunused_lifetimes&quot; RUSTC_REAL=&quot;/usr/ports/lang/rust/work/_build/x86_64-unknown-freebsd/stage2/bin/rustc&quot; RUSTC_SNAPSHOT=&quot;/usr/ports/lang/rust/work/bootstrap/bin/rustc&quot; RUSTC_SNAPSHOT_LIBDIR=&quot;/usr/ports/lang/rust/work/bootstrap/lib&quot; RUSTC_STAGE=&quot;2&quot; RUSTC_SYSROOT=&quot;/usr/ports/lang/rust/work/_build/x86_64-unknown-freebsd/stage2&quot; RUSTC_VERBOSE=&quot;2&quot; RUSTC_WRAPPER=&quot;/usr/ports/lang/rust/work/_build/bootstrap/debug/rustc&quot; RUSTDOC=&quot;/usr/ports/lang/rust/work/_build/bootstrap/debug/rustdoc&quot; RUSTDOCFLAGS=&quot;-Csymbol-mangling-version=legacy -Zunstable-options --check-cfg=cfg(feature,values(any())) -Zunstable-options --check-cfg=cfg(bootstrap) --check-cfg=cfg(stdarch_intel_sde) --check-cfg=cfg(no_fp_fmt_parse) --check-cfg=cfg(no_global_oom_handling) --check-cfg=cfg(no_rc) --check-cfg=cfg(no_sync) --check-cfg=cfg(netbsd10) --check-cfg=cfg(backtrace_in_libstd) --check-cfg=cfg(target_env,values(\&quot;libnx\&quot;,\&quot;p2\&quot;)) --check-cfg=cfg(target_arch,values(\&quot;arm64ec\&quot;,\&quot;spirv\&quot;,\&quot;nvptx\&quot;,\&quot;xtensa\&quot;)) -Wrustdoc::invalid_codeblock_attributes --crate-version 1.78.0\t(9b00956e5\t2024-04-29)\t(built\tfrom\ta\tsource\ttarball) -Clinker=clang -Zcrate-attr=doc(html_root_url=\&quot;<a href="https://doc.rust-lang.org/1.78.0/%5C" target="_blank">https://doc.rust-lang.org/1.78.0/\</a>&quot;) -Zcrate-attr=warn(rust_2018_idioms)&quot; RUSTDOC_REAL=&quot;/path/to/nowhere/rustdoc/not/required&quot; RUSTFLAGS=&quot;-Csymbol-mangling-version=legacy -Zunstable-options --check-cfg=cfg(feature,values(any())) -Zunstable-options --check-cfg=cfg(bootstrap) --check-cfg=cfg(stdarch_intel_sde) --check-cfg=cfg(no_fp_fmt_parse) --check-cfg=cfg(no_global_oom_handling) --check-cfg=cfg(no_rc) --check-cfg=cfg(no_sync) --check-cfg=cfg(netbsd10) --check-cfg=cfg(backtrace_in_libstd) --check-cfg=cfg(target_env,values(\&quot;libnx\&quot;,\&quot;p2\&quot;)) --check-cfg=cfg(target_arch,values(\&quot;arm64ec\&quot;,\&quot;spirv\&quot;,\&quot;nvptx\&quot;,\&quot;xtensa\&quot;)) -Zmacro-backtrace -Zunstable-options -Csplit-debuginfo=off -Cprefer-dynamic -Zinline-mir -Cembed-bitcode=yes -Zcrate-attr=doc(html_root_url=\&quot;<a href="https://doc.rust-lang.org/1.78.0/%5C" target="_blank">https://doc.rust-lang.org/1.78.0/\</a>&quot;)&quot; RUST_COMPILER_RT_ROOT=&quot;/usr/ports/lang/rust/work/rustc-1.78.0-src/src/llvm-project/compiler-rt&quot; RUST_TEST_THREADS=&quot;32&quot; WINAPI_NO_BUNDLED_LIBRARIES=&quot;1&quot; __CARGO_DEFAULT_LIB_METADATA=&quot;stablestd&quot; &quot;/usr/ports/lang/rust/work/bootstrap/bin/cargo&quot; &quot;build&quot; &quot;--target&quot; &quot;wasm32-unknown-unknown&quot; &quot;--release&quot; &quot;-Zcheck-cfg&quot; &quot;-Zbinary-dep-depinfo&quot; &quot;-j&quot; &quot;32&quot; &quot;-v&quot; &quot;-v&quot; &quot;--frozen&quot; &quot;--features&quot; &quot; panic-unwind backtrace compiler-builtins-c&quot; &quot;--manifest-path&quot; &quot;/usr/ports/lang/rust/work/rustc-1.78.0-src/library/sysroot/Cargo.toml&quot; &quot;--message-format&quot; &quot;json-render-diagnostics&quot;<br>expected success, got: exit status: 101<br>Traceback (most recent call last):<br>  File &quot;/usr/ports/lang/rust/work/rustc-1.78.0-src/x.py&quot;, line 50, in &lt;module&gt;<br>    bootstrap.main()<br>  File &quot;/usr/ports/lang/rust/work/rustc-1.78.0-src/src/bootstrap/bootstrap.py&quot;, line 1164, in main<br>    bootstrap(args)<br>  File &quot;/usr/ports/lang/rust/work/rustc-1.78.0-src/src/bootstrap/bootstrap.py&quot;, line 1140, in bootstrap<br>    run(args, env=env, verbose=build.verbose, is_bootstrap=True)<br>  File &quot;/usr/ports/lang/rust/work/rustc-1.78.0-src/src/bootstrap/bootstrap.py&quot;, line 187, in run<br>    raise RuntimeError(err)<br>RuntimeError: failed to run: /usr/ports/lang/rust/work/_build/bootstrap/debug/bootstrap dist --jobs=32<br>*** Error code 1<br><br>Stop.<br>make[1]: stopped in /usr/ports/lang/rust<br>*** Error code 1<br><br>Stop.<br>make: stopped in /usr/ports/security/py-cryptography<br></div><div>```</div><div><br></div><div><br></div><span class="gmail_signature_prefix">-- </span><br><div dir="ltr" class="gmail_signature" data-smartmail="gmail_signature"><div dir="ltr"><div dir="ltr"><div>Best regards,<br>Odhiambo WASHINGTON,<br>Nairobi,KE<br>+254 7 3200 0004/+254 7 2274 3223</div><div><span style="color:rgb(34,34,34)"> In </span><span style="color:rgb(34,34,34)">an Internet failure case, the #1 suspect is a constant: DNS.</span><br>&quot;<span style="font-size:12.8px">Oh, the cruft.</span><span style="font-size:12.8px">&quot;, </span><span style="font-size:12.8px">egrep -v &#39;^$|^.*#&#39; </span><span style="background-color:rgb(34,34,34);color:rgb(238,238,238);font-family:&quot;Lucida Console&quot;,Consolas,&quot;Courier New&quot;,monospace;font-size:13.6px">¯\_(ツ)_/¯</span><span style="font-size:12.8px"> :-)</span></div><div><span style="font-size:12.8px">[How to ask smart questions: </span><span style="font-size:12.8px"><a href="http://www.catb.org/~esr/faqs/smart-questions.html" target="_blank">http://www.catb.org/~esr/faqs/smart-questions.html</a>]</span></div></div></div></div></div></div>;

Want to link to this message? Use this URL: <https://mail-archive.FreeBSD.org/cgi/mid.cgi?CAAdA2WP9H3zBLrB_AaJ_mKatxyVrbN37=7VEwFXcwn8YDk2ZaQ>