Skip site navigation (1)Skip section navigation (2)
Date:      Mon, 13 Feb 2006 11:41:01 -0800
From:      paul beard <paulbeard@mac.com>
To:        gnome@FreeBSD.org
Subject:   gamin fails to build
Message-ID:  <D83CA40F-3FEF-4EFF-A460-DAB9E53216F6@mac.com>

next in thread | raw e-mail | index | archive | help
Making all in tests
gmake[2]: Entering directory `/opt/ports/devel/gamin/work/gamin-0.1.7/ 
tests'
source='testing.c' object='testing.o' libtool=no \
DEPDIR=.deps depmode=gcc /bin/sh ../depcomp \
cc -DHAVE_CONFIG_H -I. -I. -I.. -I.. -I.. -I../libgamin -I../ 
libgamin  -I/usr/local/include -D_THREAD_SAFE  -Wall -Wchar- 
subscripts -Wmissing-declarations -Wmissing-prototypes -Wnested- 
externs -Wsign-compare -Wno-sign-compare -g  -c testing.c
testing.c: In function `processCommand':
testing.c:383: syntax error before `struct'
testing.c:384: `sb' undeclared (first use in this function)
testing.c:384: (Each undeclared identifier is reported only once
testing.c:384: for each function it appears in.)
gmake[2]: *** [testing.o] Error 1
gmake[2]: Leaving directory `/opt/ports/devel/gamin/work/gamin-0.1.7/ 
tests'
gmake[1]: *** [all-recursive] Error 1
gmake[1]: Leaving directory `/opt/ports/devel/gamin/work/gamin-0.1.7'
gmake: *** [all] Error 2
*** Error code 2

FreeBSD red.paulbeard.org 4.11-RELEASE-p12 FreeBSD 4.11-RELEASE-p12  
#0: Wed Oct 12 21:28:00 PDT 2005     root@red.paulbeard.org:/usr/obj/ 
usr/src/sys/RED  i386

o	ran cvsup three times
o	ran portupgrade -a twice
o	have run through "make clean && make" twice
o	gnomeloganalyzer [http://www.freebsd.org/gnome/gnomelogalyzer.sh]  
doesn't find anything.

after one more cvsup/portupgrade run:

testing.c: In function `processCommand':
testing.c:383: syntax error before `struct'
testing.c:384: `sb' undeclared (first use in this function)
testing.c:384: (Each undeclared identifier is reported only once
testing.c:384: for each function it appears in.)
gmake[2]: *** [testing.o] Error 1
gmake[2]: Leaving directory `/opt/ports/devel/gamin/work/gamin-0.1.7/ 
tests'
gmake[1]: *** [all-recursive] Error 1
gmake[1]: Leaving directory `/opt/ports/devel/gamin/work/gamin-0.1.7'
gmake: *** [all] Error 2
*** Error code 2

Stop in /opt/ports/devel/gamin.
** Command failed [exit code 1]: /usr/bin/script -qa /tmp/ 
portupgrade11516.45 make
** Fix the problem and try again.


--
Paul Beard
contact info: www.paulbeard.org/paulbeard.vcf

Are you trying to win an argument or solve a problem?




Want to link to this message? Use this URL: <https://mail-archive.FreeBSD.org/cgi/mid.cgi?D83CA40F-3FEF-4EFF-A460-DAB9E53216F6>