Skip site navigation (1)Skip section navigation (2)
Date:      Tue, 17 Jan 2023 23:42:57 +0000 (GMT)
From:      jenkins-admin@FreeBSD.org
To:        markj@FreeBSD.org, dev-ci@FreeBSD.org
Cc:        jenkins-admin@FreeBSD.org
Subject:   FreeBSD-main-amd64-test - Build #22816 - Still Unstable
Message-ID:  <1292934434.7935.1673998977432@jenkins.ci.freebsd.org>
In-Reply-To: <1948902792.7929.1673993337341@jenkins.ci.freebsd.org>
References:  <1948902792.7929.1673993337341@jenkins.ci.freebsd.org>

next in thread | previous in thread | raw e-mail | index | archive | help
------=_Part_7934_1648144879.1673998977132
Content-Type: text/plain; charset=UTF-8
Content-Transfer-Encoding: 7bit

FreeBSD-main-amd64-test - Build #22816 (e5f5ca7fee26179725ab2d66b5500d51fe8ae113) - Still Unstable

Build information: https://ci.FreeBSD.org/job/FreeBSD-main-amd64-test/22816/
Full change log: https://ci.FreeBSD.org/job/FreeBSD-main-amd64-test/22816/changes
Full build log: https://ci.FreeBSD.org/job/FreeBSD-main-amd64-test/22816/console

Status explanation:
"Unstable" - some tests are suspected being broken by the following changes
"Still Unstable" - the failing test cases have not been fixed by these
                   following changes and this is a notification to note that
                   these changes have not been fully tested by the CI system

Change summaries:
(Those commits are likely but not certainly responsible)

e5f5ca7fee26179725ab2d66b5500d51fe8ae113 by markj:
mixer(3): remove redundant argument in _mixer_readvol()



The failed test cases:

6 tests failed.
FAILED:  lib.libc.time.mktime_test.timegm_epoch

Error Message:
/usr/src/contrib/netbsd-tests/lib/libc/time/t_mktime.c:98: Expected errno 0, got 84, in t == (time_t)0

FAILED:  sys.net.if_tun_test.235704

Error Message:
atf-check failed; see the output of the test for details

FAILED:  usr.sbin.etcupdate.preworld_test.main

Error Message:
Returned non-success exit status 1

FAILED:  sys.aio.aio_test.aio_socket_blocking_short_write

Error Message:
Test case body timed out

FAILED:  sys.aio.aio_test.aio_socket_blocking_short_write_vectored

Error Message:
Test case body timed out

FAILED:  sys.aio.aio_test.aio_socket_short_write_cancel

Error Message:
/usr/src/tests/sys/aio/aio_test.c:1396: aio_error(&iocb) == EINPROGRESS not met
------=_Part_7934_1648144879.1673998977132--



Want to link to this message? Use this URL: <https://mail-archive.FreeBSD.org/cgi/mid.cgi?1292934434.7935.1673998977432>