Skip site navigation (1)Skip section navigation (2)
Date:      Wed, 29 Mar 2023 13:27:15 +0000 (GMT)
From:      jenkins-admin@FreeBSD.org
To:        jkoshy@FreeBSD.org, mjg@FreeBSD.org, corvink@FreeBSD.org, dev-ci@FreeBSD.org
Cc:        jenkins-admin@FreeBSD.org
Subject:   FreeBSD-main-amd64-gcc12_build - Build #701 - Still Failing
Message-ID:  <1848240930.1265.1680096438013@jenkins.ci.freebsd.org>
In-Reply-To: <1639410324.1245.1680090835822@jenkins.ci.freebsd.org>
References:  <1639410324.1245.1680090835822@jenkins.ci.freebsd.org>

next in thread | previous in thread | raw e-mail | index | archive | help
------=_Part_1264_1763983061.1680096435754
Content-Type: text/plain; charset=UTF-8
Content-Transfer-Encoding: quoted-printable

FreeBSD-main-amd64-gcc12_build - Build #701 (c98d13fbf9c9b75a49e48789932cd1=
395c95e7bf) - Still Failing

Build information: https://ci.FreeBSD.org/job/FreeBSD-main-amd64-gcc12_buil=
d/701/
Full change log: https://ci.FreeBSD.org/job/FreeBSD-main-amd64-gcc12_build/=
701/changes
Full build log: https://ci.FreeBSD.org/job/FreeBSD-main-amd64-gcc12_build/7=
01/console

Status explanation:
"Failure" - the build is suspected being broken by the following changes
"Still Failing" - the build has not been fixed by the following changes and
                  this is a notification to note that these changes have
                  not been fully tested by the CI system

Change summaries:
(Those commits are likely but not certainly responsible)

57014ab77647c74fcb0a01d68e21a161ceb95d5a by jkoshy:
pmc: Add a reminder to maintain documentation.

7c31de1a3cf06fa9b0e4b11cc7039a55bb433fa5 by mjg:
ufs: stop doing refcount_init on made up creds

80cf427b8dc18bc5c26fed6d07bc5c5eda4545b0 by mjg:
proc: shave a lock trip on exit if possible

c98d13fbf9c9b75a49e48789932cd1395c95e7bf by corvink:
bhyve: fix spelling mistake of pcireg option



The end of the build log:

[...truncated 83.40 MB...]
/usr/local/bin/x86_64-unknown-freebsd13.1-gcc12 --sysroot=3D/tmp/obj/worksp=
ace/src/amd64.amd64/tmp -B/usr/local/x86_64-unknown-freebsd13.1/bin/  -O2 -=
pipe -fno-common -DPLATFORM_CONFIG_H=3D\"/workspace/src/lib/libarchive/conf=
ig_freebsd.h\" -I/workspace/src/lib/libarchive -I/tmp/obj/workspace/src/amd=
64.amd64/usr.bin/tar/tests -I/workspace/src/contrib/libarchive/libarchive -=
I/workspace/src/contrib/libarchive/tar -I/workspace/src/contrib/libarchive/=
tar/test -I/workspace/src/contrib/libarchive/test_utils   -fPIE -g -MD  -MF=
.depend.bsdtar_test.test_patterns.o -MTtest_patterns.o -std=3Dgnu99 -Wno-fo=
rmat-zero-length -fstack-protector-strong -Wsystem-headers -Werror -Wall -W=
no-format-y2k -W -Wno-unused-parameter -Wmissing-prototypes -Wpointer-arith=
 -Wno-uninitialized -Wno-pointer-sign -Wdate-time -Wno-error=3Daddress -Wno=
-error=3Darray-bounds -Wno-error=3Dattributes -Wno-error=3Dbool-compare -Wn=
o-error=3Dcast-align -Wno-error=3Dclobbered -Wno-error=3Ddeprecated-declara=
tions -Wno-error=3Denum-compare -Wno-error=3Dextra -Wno-error=3Dlogical-not=
-parentheses -Wno-error=3Dstrict-aliasing -Wno-error=3Duninitialized -Wno-e=
rror=3Dunused-but-set-variable -Wno-error=3Dunused-function -Wno-error=3Dun=
used-value -Wno-error=3Dempty-body -Wno-error=3Dmaybe-uninitialized -Wno-er=
ror=3Dnonnull-compare -Wno-error=3Dshift-negative-value -Wno-error=3Dtautol=
ogical-compare -Wno-error=3Dunused-const-variable -Wno-error=3Dbool-operati=
on -Wno-error=3Ddeprecated -Wno-error=3Dexpansion-to-defined -Wno-error=3Df=
ormat-overflow -Wno-error=3Dformat-truncation -Wno-error=3Dimplicit-fallthr=
ough -Wno-error=3Dint-in-bool-context -Wno-error=3Dmemset-elt-size -Wno-err=
or=3Dnoexcept-type -Wno-error=3Dnonnull -Wno-error=3Dpointer-compare -Wno-e=
rror=3Dstringop-overflow -Wno-error=3Daggressive-loop-optimizations -Wno-er=
ror=3Dcast-function-type -Wno-error=3Dcatch-value -Wno-error=3Dmultistateme=
nt-macros -Wno-error=3Drestrict -Wno-error=3Dsizeof-pointer-memaccess -Wno-=
error=3Dstringop-truncation -Wno-return-type -Wno-address-of-packed-member =
   -c /workspace/src/contrib/libarchive/tar/test/test_patterns.c -o test_pa=
tterns.o
--- all_subdir_usr.sbin ---
--- rsmemory.o ---
/usr/local/bin/x86_64-unknown-freebsd13.1-gcc12 --sysroot=3D/tmp/obj/worksp=
ace/src/amd64.amd64/tmp -B/usr/local/x86_64-unknown-freebsd13.1/bin/  -O2 -=
pipe -fno-common -DACPI_DB_APP -DACPI_EXEC_APP -fno-strict-aliasing   -I/wo=
rkspace/src/sys -fPIE -g -MD  -MF.depend.rsmemory.o -MTrsmemory.o -std=3Dgn=
u99 -Wno-format-zero-length -fstack-protector-strong -Wsystem-headers -Werr=
or -Wall -Wno-format-y2k -W -Wno-unused-parameter -Wmissing-prototypes -Wpo=
inter-arith -Wno-uninitialized -Wno-pointer-sign -Wdate-time -Wno-error=3Da=
ddress -Wno-error=3Darray-bounds -Wno-error=3Dattributes -Wno-error=3Dbool-=
compare -Wno-error=3Dcast-align -Wno-error=3Dclobbered -Wno-error=3Ddepreca=
ted-declarations -Wno-error=3Denum-compare -Wno-error=3Dextra -Wno-error=3D=
logical-not-parentheses -Wno-error=3Dstrict-aliasing -Wno-error=3Duninitial=
ized -Wno-error=3Dunused-but-set-variable -Wno-error=3Dunused-function -Wno=
-error=3Dunused-value -Wno-error=3Dempty-body -Wno-error=3Dmaybe-uninitiali=
zed -Wno-error=3Dnonnull-compare -Wno-error=3Dshift-negative-value -Wno-err=
or=3Dtautological-compare -Wno-error=3Dunused-const-variable -Wno-error=3Db=
ool-operation -Wno-error=3Ddeprecated -Wno-error=3Dexpansion-to-defined -Wn=
o-error=3Dformat-overflow -Wno-error=3Dformat-truncation -Wno-error=3Dimpli=
cit-fallthrough -Wno-error=3Dint-in-bool-context -Wno-error=3Dmemset-elt-si=
ze -Wno-error=3Dnoexcept-type -Wno-error=3Dnonnull -Wno-error=3Dpointer-com=
pare -Wno-error=3Dstringop-overflow -Wno-error=3Daggressive-loop-optimizati=
ons -Wno-error=3Dcast-function-type -Wno-error=3Dcatch-value -Wno-error=3Dm=
ultistatement-macros -Wno-error=3Drestrict -Wno-error=3Dsizeof-pointer-mema=
ccess -Wno-error=3Dstringop-truncation -Wno-return-type -Wno-address-of-pac=
ked-member      -c /workspace/src/sys/contrib/dev/acpica/components/resourc=
es/rsmemory.c -o rsmemory.o
--- all_subdir_usr.bin ---
--- all_subdir_usr.bin/tee ---
=3D=3D=3D> usr.bin/tee (all)
--- .depend ---
--- all_subdir_usr.bin/tar ---
--- test_print_longpath.o ---
--- all_subdir_usr.bin/tee ---
echo tee.full: /tmp/obj/workspace/src/amd64.amd64/tmp/usr/lib/libc.a  >> .d=
epend
--- tee.o ---
--- all_subdir_usr.bin/tar ---
/usr/local/bin/x86_64-unknown-freebsd13.1-gcc12 --sysroot=3D/tmp/obj/worksp=
ace/src/amd64.amd64/tmp -B/usr/local/x86_64-unknown-freebsd13.1/bin/  -O2 -=
pipe -fno-common -DPLATFORM_CONFIG_H=3D\"/workspace/src/lib/libarchive/conf=
ig_freebsd.h\" -I/workspace/src/lib/libarchive -I/tmp/obj/workspace/src/amd=
64.amd64/usr.bin/tar/tests -I/workspace/src/contrib/libarchive/libarchive -=
I/workspace/src/contrib/libarchive/tar -I/workspace/src/contrib/libarchive/=
tar/test -I/workspace/src/contrib/libarchive/test_utils   -fPIE -g -MD  -MF=
.depend.bsdtar_test.test_print_longpath.o -MTtest_print_longpath.o -std=3Dg=
nu99 -Wno-format-zero-length -fstack-protector-strong -Wsystem-headers -Wer=
ror -Wall -Wno-format-y2k -W -Wno-unused-parameter -Wmissing-prototypes -Wp=
ointer-arith -Wno-uninitialized -Wno-pointer-sign -Wdate-time -Wno-error=3D=
address -Wno-error=3Darray-bounds -Wno-error=3Dattributes -Wno-error=3Dbool=
-compare -Wno-error=3Dcast-align -Wno-error=3Dclobbered -Wno-error=3Ddeprec=
ated-declarations -Wno-error=3Denum-compare -Wno-error=3Dextra -Wno-error=
=3Dlogical-not-parentheses -Wno-error=3Dstrict-aliasing -Wno-error=3Duninit=
ialized -Wno-error=3Dunused-but-set-variable -Wno-error=3Dunused-function -=
Wno-error=3Dunused-value -Wno-error=3Dempty-body -Wno-error=3Dmaybe-uniniti=
alized -Wno-error=3Dnonnull-compare -Wno-error=3Dshift-negative-value -Wno-=
error=3Dtautological-compare -Wno-error=3Dunused-const-variable -Wno-error=
=3Dbool-operation -Wno-error=3Ddeprecated -Wno-error=3Dexpansion-to-defined=
 -Wno-error=3Dformat-overflow -Wno-error=3Dformat-truncation -Wno-error=3Di=
mplicit-fallthrough -Wno-error=3Dint-in-bool-context -Wno-error=3Dmemset-el=
t-size -Wno-error=3Dnoexcept-type -Wno-error=3Dnonnull -Wno-error=3Dpointer=
-compare -Wno-error=3Dstringop-overflow -Wno-error=3Daggressive-loop-optimi=
zations -Wno-error=3Dcast-function-type -Wno-error=3Dcatch-value -Wno-error=
=3Dmultistatement-macros -Wno-error=3Drestrict -Wno-error=3Dsizeof-pointer-=
memaccess -Wno-error=3Dstringop-truncation -Wno-return-type -Wno-address-of=
-packed-member    -c /workspace/src/contrib/libarchive/tar/test/test_print_=
longpath.c -o test_print_longpath.o
--- all_subdir_usr.bin/tee ---
/usr/local/bin/x86_64-unknown-freebsd13.1-gcc12 --sysroot=3D/tmp/obj/worksp=
ace/src/amd64.amd64/tmp -B/usr/local/x86_64-unknown-freebsd13.1/bin/  -O2 -=
pipe -fno-common   -fPIE -g -MD  -MF.depend.tee.o -MTtee.o -std=3Dgnu99 -Wn=
o-format-zero-length -fstack-protector-strong -Wsystem-headers -Werror -Wal=
l -Wno-format-y2k -W -Wno-unused-parameter -Wmissing-prototypes -Wpointer-a=
rith -Wreturn-type -Wcast-qual -Wwrite-strings -Wswitch -Wshadow -Wunused-p=
arameter -Wcast-align -Wchar-subscripts -Wnested-externs -Wold-style-defini=
tion -Wno-pointer-sign -Wdate-time -Wno-error=3Daddress -Wno-error=3Darray-=
bounds -Wno-error=3Dattributes -Wno-error=3Dbool-compare -Wno-error=3Dcast-=
align -Wno-error=3Dclobbered -Wno-error=3Ddeprecated-declarations -Wno-erro=
r=3Denum-compare -Wno-error=3Dextra -Wno-error=3Dlogical-not-parentheses -W=
no-error=3Dstrict-aliasing -Wno-error=3Duninitialized -Wno-error=3Dunused-b=
ut-set-variable -Wno-error=3Dunused-function -Wno-error=3Dunused-value -Wno=
-error=3Dempty-body -Wno-error=3Dmaybe-uninitialized -Wno-error=3Dnonnull-c=
ompare -Wno-error=3Dshift-negative-value -Wno-error=3Dtautological-compare =
-Wno-error=3Dunused-const-variable -Wno-error=3Dbool-operation -Wno-error=
=3Ddeprecated -Wno-error=3Dexpansion-to-defined -Wno-error=3Dformat-overflo=
w -Wno-error=3Dformat-truncation -Wno-error=3Dimplicit-fallthrough -Wno-err=
or=3Dint-in-bool-context -Wno-error=3Dmemset-elt-size -Wno-error=3Dnoexcept=
-type -Wno-error=3Dnonnull -Wno-error=3Dpointer-compare -Wno-error=3Dstring=
op-overflow -Wno-error=3Daggressive-loop-optimizations -Wno-error=3Dcast-fu=
nction-type -Wno-error=3Dcatch-value -Wno-error=3Dmultistatement-macros -Wn=
o-error=3Drestrict -Wno-error=3Dsizeof-pointer-memaccess -Wno-error=3Dstrin=
gop-truncation -Wno-return-type       -c /workspace/src/usr.bin/tee/tee.c -=
o tee.o
--- all_subdir_usr.sbin ---
--- rsmisc.o ---
/usr/local/bin/x86_64-unknown-freebsd13.1-gcc12 --sysroot=3D/tmp/obj/worksp=
ace/src/amd64.amd64/tmp -B/usr/local/x86_64-unknown-freebsd13.1/bin/  -O2 -=
pipe -fno-common -DACPI_DB_APP -DACPI_EXEC_APP -fno-strict-aliasing   -I/wo=
rkspace/src/sys -fPIE -g -MD  -MF.depend.rsmisc.o -MTrsmisc.o -std=3Dgnu99 =
-Wno-format-zero-length -fstack-protector-strong -Wsystem-headers -Werror -=
Wall -Wno-format-y2k -W -Wno-unused-parameter -Wmissing-prototypes -Wpointe=
r-arith -Wno-uninitialized -Wno-pointer-sign -Wdate-time -Wno-error=3Daddre=
ss -Wno-error=3Darray-bounds -Wno-error=3Dattributes -Wno-error=3Dbool-comp=
are -Wno-error=3Dcast-align -Wno-error=3Dclobbered -Wno-error=3Ddeprecated-=
declarations -Wno-error=3Denum-compare -Wno-error=3Dextra -Wno-error=3Dlogi=
cal-not-parentheses -Wno-error=3Dstrict-aliasing -Wno-error=3Duninitialized=
 -Wno-error=3Dunused-but-set-variable -Wno-error=3Dunused-function -Wno-err=
or=3Dunused-value -Wno-error=3Dempty-body -Wno-error=3Dmaybe-uninitialized =
-Wno-error=3Dnonnull-compare -Wno-error=3Dshift-negative-value -Wno-error=
=3Dtautological-compare -Wno-error=3Dunused-const-variable -Wno-error=3Dboo=
l-operation -Wno-error=3Ddeprecated -Wno-error=3Dexpansion-to-defined -Wno-=
error=3Dformat-overflow -Wno-error=3Dformat-truncation -Wno-error=3Dimplici=
t-fallthrough -Wno-error=3Dint-in-bool-context -Wno-error=3Dmemset-elt-size=
 -Wno-error=3Dnoexcept-type -Wno-error=3Dnonnull -Wno-error=3Dpointer-compa=
re -Wno-error=3Dstringop-overflow -Wno-error=3Daggressive-loop-optimization=
s -Wno-error=3Dcast-function-type -Wno-error=3Dcatch-value -Wno-error=3Dmul=
tistatement-macros -Wno-error=3Drestrict -Wno-error=3Dsizeof-pointer-memacc=
ess -Wno-error=3Dstringop-truncation -Wno-return-type -Wno-address-of-packe=
d-member      -c /workspace/src/sys/contrib/dev/acpica/components/resources=
/rsmisc.c -o rsmisc.o
--- all_subdir_usr.bin ---
/workspace/src/usr.bin/tee/tee.c:42:19: warning: 'rcsid' defined but not us=
ed [-Wunused-const-variable=3D]
   42 | static const char rcsid[] =3D
      |                   ^~~~~
/workspace/src/usr.bin/tee/tee.c:33:19: warning: 'copyright' defined but no=
t used [-Wunused-const-variable=3D]
   33 | static const char copyright[] =3D
      |                   ^~~~~~~~~
--- all_subdir_usr.bin/tar ---
--- test_stdio.o ---
/usr/local/bin/x86_64-unknown-freebsd13.1-gcc12 --sysroot=3D/tmp/obj/worksp=
ace/src/amd64.amd64/tmp -B/usr/local/x86_64-unknown-freebsd13.1/bin/  -O2 -=
pipe -fno-common -DPLATFORM_CONFIG_H=3D\"/workspace/src/lib/libarchive/conf=
ig_freebsd.h\" -I/workspace/src/lib/libarchive -I/tmp/obj/workspace/src/amd=
64.amd64/usr.bin/tar/tests -I/workspace/src/contrib/libarchive/libarchive -=
I/workspace/src/contrib/libarchive/tar -I/workspace/src/contrib/libarchive/=
tar/test -I/workspace/src/contrib/libarchive/test_utils   -fPIE -g -MD  -MF=
.depend.bsdtar_test.test_stdio.o -MTtest_stdio.o -std=3Dgnu99 -Wno-format-z=
ero-length -fstack-protector-strong -Wsystem-headers -Werror -Wall -Wno-for=
mat-y2k -W -Wno-unused-parameter -Wmissing-prototypes -Wpointer-arith -Wno-=
uninitialized -Wno-pointer-sign -Wdate-time -Wno-error=3Daddress -Wno-error=
=3Darray-bounds -Wno-error=3Dattributes -Wno-error=3Dbool-compare -Wno-erro=
r=3Dcast-align -Wno-error=3Dclobbered -Wno-error=3Ddeprecated-declarations =
-Wno-error=3Denum-compare -Wno-error=3Dextra -Wno-error=3Dlogical-not-paren=
theses -Wno-error=3Dstrict-aliasing -Wno-error=3Duninitialized -Wno-error=
=3Dunused-but-set-variable -Wno-error=3Dunused-function -Wno-error=3Dunused=
-value -Wno-error=3Dempty-body -Wno-error=3Dmaybe-uninitialized -Wno-error=
=3Dnonnull-compare -Wno-error=3Dshift-negative-value -Wno-error=3Dtautologi=
cal-compare -Wno-error=3Dunused-const-variable -Wno-error=3Dbool-operation =
-Wno-error=3Ddeprecated -Wno-error=3Dexpansion-to-defined -Wno-error=3Dform=
at-overflow -Wno-error=3Dformat-truncation -Wno-error=3Dimplicit-fallthroug=
h -Wno-error=3Dint-in-bool-context -Wno-error=3Dmemset-elt-size -Wno-error=
=3Dnoexcept-type -Wno-error=3Dnonnull -Wno-error=3Dpointer-compare -Wno-err=
or=3Dstringop-overflow -Wno-error=3Daggressive-loop-optimizations -Wno-erro=
r=3Dcast-function-type -Wno-error=3Dcatch-value -Wno-error=3Dmultistatement=
-macros -Wno-error=3Drestrict -Wno-error=3Dsizeof-pointer-memaccess -Wno-er=
ror=3Dstringop-truncation -Wno-return-type -Wno-address-of-packed-member   =
 -c /workspace/src/contrib/libarchive/tar/test/test_stdio.c -o test_stdio.o
--- all_subdir_lib ---
--- all_subdir_lib/googletest/tests/gtest ---
--- gtest_throw_on_failure_ex_test ---
/usr/local/bin/x86_64-unknown-freebsd13.1-g++12 --sysroot=3D/tmp/obj/worksp=
ace/src/amd64.amd64/tmp -B/usr/local/x86_64-unknown-freebsd13.1/bin/ -O2 -p=
ipe -fno-common -fPIE -Wno-format-zero-length -fstack-protector-strong -Wsy=
stem-headers -Wall -Wno-format-y2k -W -Wno-unused-parameter -Wpointer-arith=
 -Wreturn-type -Wcast-qual -Wwrite-strings -Wswitch -Wshadow -Wunused-param=
eter -Wcast-align -Wchar-subscripts -Wdate-time -Wno-error=3Daddress -Wno-e=
rror=3Darray-bounds -Wno-error=3Dattributes -Wno-error=3Dbool-compare -Wno-=
error=3Dcast-align -Wno-error=3Dclobbered -Wno-error=3Ddeprecated-declarati=
ons -Wno-error=3Denum-compare -Wno-error=3Dextra -Wno-error=3Dlogical-not-p=
arentheses -Wno-error=3Dstrict-aliasing -Wno-error=3Duninitialized -Wno-err=
or=3Dunused-but-set-variable -Wno-error=3Dunused-function -Wno-error=3Dunus=
ed-value -Wno-error=3Dempty-body -Wno-error=3Dmaybe-uninitialized -Wno-erro=
r=3Dnonnull-compare -Wno-error=3Dshift-negative-value -Wno-error=3Dtautolog=
ical-compare -Wno-error=3Dunused-const-variable -Wno-error=3Dbool-operation=
 -Wno-error=3Ddeprecated -Wno-error=3Dexpansion-to-defined -Wno-error=3Dfor=
mat-overflow -Wno-error=3Dformat-truncation -Wno-error=3Dimplicit-fallthrou=
gh -Wno-error=3Dint-in-bool-context -Wno-error=3Dmemset-elt-size -Wno-error=
=3Dnoexcept-type -Wno-error=3Dnonnull -Wno-error=3Dpointer-compare -Wno-err=
or=3Dstringop-overflow -Wno-error=3Daggressive-loop-optimizations -Wno-erro=
r=3Dcast-function-type -Wno-error=3Dcatch-value -Wno-error=3Dmultistatement=
-macros -Wno-error=3Drestrict -Wno-error=3Dsizeof-pointer-memaccess -Wno-er=
ror=3Dstringop-truncation -Wno-return-type -I/tmp/obj/workspace/src/amd64.a=
md64/tmp/usr/include/private -I/workspace/src/contrib/googletest/googletest=
/include -I/workspace/src/contrib/googletest/googletest -I/tmp/obj/workspac=
e/src/amd64.amd64/tmp/usr/include/private -DGTEST_HAS_POSIX_RE=3D1 -DGTEST_=
HAS_PTHREAD=3D1 -DGTEST_HAS_STREAM_REDIRECTION=3D1 -frtti -DGTEST_HAS_POSIX=
_RE=3D1 -DGTEST_HAS_PTHREAD=3D1 -DGTEST_HAS_STREAM_REDIRECTION=3D1 -frtti -=
fPIE -std=3Dc++11 -Wno-deprecated-copy -Wno-literal-suffix -Wno-error=3Dunk=
nown-pragmas  -Wl,-zrelro -pie  -o gtest_throw_on_failure_ex_test  gtest_th=
row_on_failure_ex_test.o -lprivategtest
--- all_subdir_usr.bin ---
--- all_subdir_usr.bin/tee ---
--- tee.full ---
--- tee.1.gz ---
--- tee.full ---
/usr/local/bin/x86_64-unknown-freebsd13.1-gcc12 --sysroot=3D/tmp/obj/worksp=
ace/src/amd64.amd64/tmp -B/usr/local/x86_64-unknown-freebsd13.1/bin/ -O2 -p=
ipe -fno-common -fPIE -g -std=3Dgnu99 -Wno-format-zero-length -fstack-prote=
ctor-strong -Wsystem-headers -Werror -Wall -Wno-format-y2k -W -Wno-unused-p=
arameter -Wmissing-prototypes -Wpointer-arith -Wreturn-type -Wcast-qual -Ww=
rite-strings -Wswitch -Wshadow -Wunused-parameter -Wcast-align -Wchar-subsc=
ripts -Wnested-externs -Wold-style-definition -Wno-pointer-sign -Wdate-time=
 -Wno-error=3Daddress -Wno-error=3Darray-bounds -Wno-error=3Dattributes -Wn=
o-error=3Dbool-compare -Wno-error=3Dcast-align -Wno-error=3Dclobbered -Wno-=
error=3Ddeprecated-declarations -Wno-error=3Denum-compare -Wno-error=3Dextr=
a -Wno-error=3Dlogical-not-parentheses -Wno-error=3Dstrict-aliasing -Wno-er=
ror=3Duninitialized -Wno-error=3Dunused-but-set-variable -Wno-error=3Dunuse=
d-function -Wno-error=3Dunused-value -Wno-error=3Dempty-body -Wno-error=3Dm=
aybe-uninitialized -Wno-error=3Dnonnull-compare -Wno-error=3Dshift-negative=
-value -Wno-error=3Dtautological-compare -Wno-error=3Dunused-const-variable=
 -Wno-error=3Dbool-operation -Wno-error=3Ddeprecated -Wno-error=3Dexpansion=
-to-defined -Wno-error=3Dformat-overflow -Wno-error=3Dformat-truncation -Wn=
o-error=3Dimplicit-fallthrough -Wno-error=3Dint-in-bool-context -Wno-error=
=3Dmemset-elt-size -Wno-error=3Dnoexcept-type -Wno-error=3Dnonnull -Wno-err=
or=3Dpointer-compare -Wno-error=3Dstringop-overflow -Wno-error=3Daggressive=
-loop-optimizations -Wno-error=3Dcast-function-type -Wno-error=3Dcatch-valu=
e -Wno-error=3Dmultistatement-macros -Wno-error=3Drestrict -Wno-error=3Dsiz=
eof-pointer-memaccess -Wno-error=3Dstringop-truncation -Wno-return-type  -W=
l,-zrelro -pie   -o tee.full tee.o =20
--- tee.1.gz ---
gzip -cn /workspace/src/usr.bin/tee/tee.1 > tee.1.gz
--- all_subdir_lib ---
--- all_subdir_lib/libradius ---
=3D=3D=3D> lib/libradius (all)
--- libradius.3.gz ---
gzip -cn /workspace/src/lib/libradius/libradius.3 > libradius.3.gz
--- radius.conf.5.gz ---
gzip -cn /workspace/src/lib/libradius/radius.conf.5 > radius.conf.5.gz
--- all_subdir_usr.bin ---
--- tee.debug ---
--- all_subdir_usr.sbin ---
--- all_subdir_usr.sbin/tcpdump ---
--- util-print.o ---
--- all_subdir_usr.bin ---
/usr/local/x86_64-unknown-freebsd13.1/bin/objcopy --only-keep-debug tee.ful=
l tee.debug
--- all_subdir_usr.sbin ---
/usr/local/bin/x86_64-unknown-freebsd13.1-gcc12 --sysroot=3D/tmp/obj/worksp=
ace/src/amd64.amd64/tmp -B/usr/local/x86_64-unknown-freebsd13.1/bin/  -O2 -=
pipe -fno-common   -I/workspace/src/usr.sbin/tcpdump/tcpdump -I/workspace/s=
rc/contrib/tcpdump -DHAVE_CONFIG_H -D_U_=3D"__attribute__((unused))" -DINET=
6 -DHAVE_OS_IPV6_SUPPORT -DLBL_ALIGN -DHAVE_CASPER -I/tmp/obj/workspace/src=
/amd64.amd64/tmp/usr/include/openssl -DHAVE_LIBCRYPTO -DHAVE_OPENSSL_EVP_H =
-DHAVE_NET_PFVAR_H -DHAVE_NET_IF_PFLOG_H -fPIE -g -MD  -MF.depend.util-prin=
t.o -MTutil-print.o -std=3Dgnu99 -Wno-format-zero-length -fstack-protector-=
strong -Wsystem-headers -Werror -Wall -Wno-format-y2k -W -Wno-unused-parame=
ter -Wmissing-prototypes -Wpointer-arith -Wno-uninitialized -Wno-pointer-si=
gn -Wdate-time -Wno-error=3Daddress -Wno-error=3Darray-bounds -Wno-error=3D=
attributes -Wno-error=3Dbool-compare -Wno-error=3Dcast-align -Wno-error=3Dc=
lobbered -Wno-error=3Ddeprecated-declarations -Wno-error=3Denum-compare -Wn=
o-error=3Dextra -Wno-error=3Dlogical-not-parentheses -Wno-error=3Dstrict-al=
iasing -Wno-error=3Duninitialized -Wno-error=3Dunused-but-set-variable -Wno=
-error=3Dunused-function -Wno-error=3Dunused-value -Wno-error=3Dempty-body =
-Wno-error=3Dmaybe-uninitialized -Wno-error=3Dnonnull-compare -Wno-error=3D=
shift-negative-value -Wno-error=3Dtautological-compare -Wno-error=3Dunused-=
const-variable -Wno-error=3Dbool-operation -Wno-error=3Ddeprecated -Wno-err=
or=3Dexpansion-to-defined -Wno-error=3Dformat-overflow -Wno-error=3Dformat-=
truncation -Wno-error=3Dimplicit-fallthrough -Wno-error=3Dint-in-bool-conte=
xt -Wno-error=3Dmemset-elt-size -Wno-error=3Dnoexcept-type -Wno-error=3Dnon=
null -Wno-error=3Dpointer-compare -Wno-error=3Dstringop-overflow -Wno-error=
=3Daggressive-loop-optimizations -Wno-error=3Dcast-function-type -Wno-error=
=3Dcatch-value -Wno-error=3Dmultistatement-macros -Wno-error=3Drestrict -Wn=
o-error=3Dsizeof-pointer-memaccess -Wno-error=3Dstringop-truncation -Wno-re=
turn-type -Wno-address-of-packed-member      -c /workspace/src/contrib/tcpd=
ump/util-print.c -o util-print.o
--- version.o ---
--- all_subdir_usr.bin ---
--- tee ---
--- all_subdir_usr.sbin ---
/usr/local/bin/x86_64-unknown-freebsd13.1-gcc12 --sysroot=3D/tmp/obj/worksp=
ace/src/amd64.amd64/tmp -B/usr/local/x86_64-unknown-freebsd13.1/bin/  -O2 -=
pipe -fno-common   -I/workspace/src/usr.sbin/tcpdump/tcpdump -I/workspace/s=
rc/contrib/tcpdump -DHAVE_CONFIG_H -D_U_=3D"__attribute__((unused))" -DINET=
6 -DHAVE_OS_IPV6_SUPPORT -DLBL_ALIGN -DHAVE_CASPER -I/tmp/obj/workspace/src=
/amd64.amd64/tmp/usr/include/openssl -DHAVE_LIBCRYPTO -DHAVE_OPENSSL_EVP_H =
-DHAVE_NET_PFVAR_H -DHAVE_NET_IF_PFLOG_H -fPIE -g -MD  -MF.depend.version.o=
 -MTversion.o -std=3Dgnu99 -Wno-format-zero-length -fstack-protector-strong=
 -Wsystem-headers -Werror -Wall -Wno-format-y2k -W -Wno-unused-parameter -W=
missing-prototypes -Wpointer-arith -Wno-uninitialized -Wno-pointer-sign -Wd=
ate-time -Wno-error=3Daddress -Wno-error=3Darray-bounds -Wno-error=3Dattrib=
utes -Wno-error=3Dbool-compare -Wno-error=3Dcast-align -Wno-error=3Dclobber=
ed -Wno-error=3Ddeprecated-declarations -Wno-error=3Denum-compare -Wno-erro=
r=3Dextra -Wno-error=3Dlogical-not-parentheses -Wno-error=3Dstrict-aliasing=
 -Wno-error=3Duninitialized -Wno-error=3Dunused-but-set-variable -Wno-error=
=3Dunused-function -Wno-error=3Dunused-value -Wno-error=3Dempty-body -Wno-e=
rror=3Dmaybe-uninitialized -Wno-error=3Dnonnull-compare -Wno-error=3Dshift-=
negative-value -Wno-error=3Dtautological-compare -Wno-error=3Dunused-const-=
variable -Wno-error=3Dbool-operation -Wno-error=3Ddeprecated -Wno-error=3De=
xpansion-to-defined -Wno-error=3Dformat-overflow -Wno-error=3Dformat-trunca=
tion -Wno-error=3Dimplicit-fallthrough -Wno-error=3Dint-in-bool-context -Wn=
o-error=3Dmemset-elt-size -Wno-error=3Dnoexcept-type -Wno-error=3Dnonnull -=
Wno-error=3Dpointer-compare -Wno-error=3Dstringop-overflow -Wno-error=3Dagg=
ressive-loop-optimizations -Wno-error=3Dcast-function-type -Wno-error=3Dcat=
ch-value -Wno-error=3Dmultistatement-macros -Wno-error=3Drestrict -Wno-erro=
r=3Dsizeof-pointer-memaccess -Wno-error=3Dstringop-truncation -Wno-return-t=
ype -Wno-address-of-packed-member      -c version.c -o version.o
--- all_subdir_usr.bin ---
--- all_subdir_usr.bin/tar ---
--- test_strip_components.o ---
--- all_subdir_usr.bin/tee ---
/usr/local/x86_64-unknown-freebsd13.1/bin/objcopy --strip-debug --add-gnu-d=
ebuglink=3Dtee.debug  tee.full tee
--- all_subdir_usr.bin/tar ---
/usr/local/bin/x86_64-unknown-freebsd13.1-gcc12 --sysroot=3D/tmp/obj/worksp=
ace/src/amd64.amd64/tmp -B/usr/local/x86_64-unknown-freebsd13.1/bin/  -O2 -=
pipe -fno-common -DPLATFORM_CONFIG_H=3D\"/workspace/src/lib/libarchive/conf=
ig_freebsd.h\" -I/workspace/src/lib/libarchive -I/tmp/obj/workspace/src/amd=
64.amd64/usr.bin/tar/tests -I/workspace/src/contrib/libarchive/libarchive -=
I/workspace/src/contrib/libarchive/tar -I/workspace/src/contrib/libarchive/=
tar/test -I/workspace/src/contrib/libarchive/test_utils   -fPIE -g -MD  -MF=
.depend.bsdtar_test.test_strip_components.o -MTtest_strip_components.o -std=
=3Dgnu99 -Wno-format-zero-length -fstack-protector-strong -Wsystem-headers =
-Werror -Wall -Wno-format-y2k -W -Wno-unused-parameter -Wmissing-prototypes=
 -Wpointer-arith -Wno-uninitialized -Wno-pointer-sign -Wdate-time -Wno-erro=
r=3Daddress -Wno-error=3Darray-bounds -Wno-error=3Dattributes -Wno-error=3D=
bool-compare -Wno-error=3Dcast-align -Wno-error=3Dclobbered -Wno-error=3Dde=
precated-declarations -Wno-error=3Denum-compare -Wno-error=3Dextra -Wno-err=
or=3Dlogical-not-parentheses -Wno-error=3Dstrict-aliasing -Wno-error=3Dunin=
itialized -Wno-error=3Dunused-but-set-variable -Wno-error=3Dunused-function=
 -Wno-error=3Dunused-value -Wno-error=3Dempty-body -Wno-error=3Dmaybe-unini=
tialized -Wno-error=3Dnonnull-compare -Wno-error=3Dshift-negative-value -Wn=
o-error=3Dtautological-compare -Wno-error=3Dunused-const-variable -Wno-erro=
r=3Dbool-operation -Wno-error=3Ddeprecated -Wno-error=3Dexpansion-to-define=
d -Wno-error=3Dformat-overflow -Wno-error=3Dformat-truncation -Wno-error=3D=
implicit-fallthrough -Wno-error=3Dint-in-bool-context -Wno-error=3Dmemset-e=
lt-size -Wno-error=3Dnoexcept-type -Wno-error=3Dnonnull -Wno-error=3Dpointe=
r-compare -Wno-error=3Dstringop-overflow -Wno-error=3Daggressive-loop-optim=
izations -Wno-error=3Dcast-function-type -Wno-error=3Dcatch-value -Wno-erro=
r=3Dmultistatement-macros -Wno-error=3Drestrict -Wno-error=3Dsizeof-pointer=
-memaccess -Wno-error=3Dstringop-truncation -Wno-return-type -Wno-address-o=
f-packed-member    -c /workspace/src/contrib/libarchive/tar/test/test_strip=
_components.c -o test_strip_components.o
--- test_symlink_dir.o ---
/usr/local/bin/x86_64-unknown-freebsd13.1-gcc12 --sysroot=3D/tmp/obj/worksp=
ace/src/amd64.amd64/tmp -B/usr/local/x86_64-unknown-freebsd13.1/bin/  -O2 -=
pipe -fno-common -DPLATFORM_CONFIG_H=3D\"/workspace/src/lib/libarchive/conf=
ig_freebsd.h\" -I/workspace/src/lib/libarchive -I/tmp/obj/workspace/src/amd=
64.amd64/usr.bin/tar/tests -I/workspace/src/contrib/libarchive/libarchive -=
I/workspace/src/contrib/libarchive/tar -I/workspace/src/contrib/libarchive/=
tar/test -I/workspace/src/contrib/libarchive/test_utils   -fPIE -g -MD  -MF=
.depend.bsdtar_test.test_symlink_dir.o -MTtest_symlink_dir.o -std=3Dgnu99 -=
Wno-format-zero-length -fstack-protector-strong -Wsystem-headers -Werror -W=
all -Wno-format-y2k -W -Wno-unused-parameter -Wmissing-prototypes -Wpointer=
-arith -Wno-uninitialized -Wno-pointer-sign -Wdate-time -Wno-error=3Daddres=
s -Wno-error=3Darray-bounds -Wno-error=3Dattributes -Wno-error=3Dbool-compa=
re -Wno-error=3Dcast-align -Wno-error=3Dclobbered -Wno-error=3Ddeprecated-d=
eclarations -Wno-error=3Denum-compare -Wno-error=3Dextra -Wno-error=3Dlogic=
al-not-parentheses -Wno-error=3Dstrict-aliasing -Wno-error=3Duninitialized =
-Wno-error=3Dunused-but-set-variable -Wno-error=3Dunused-function -Wno-erro=
r=3Dunused-value -Wno-error=3Dempty-body -Wno-error=3Dmaybe-uninitialized -=
Wno-error=3Dnonnull-compare -Wno-error=3Dshift-negative-value -Wno-error=3D=
tautological-compare -Wno-error=3Dunused-const-variable -Wno-error=3Dbool-o=
peration -Wno-error=3Ddeprecated -Wno-error=3Dexpansion-to-defined -Wno-err=
or=3Dformat-overflow -Wno-error=3Dformat-truncation -Wno-error=3Dimplicit-f=
allthrough -Wno-error=3Dint-in-bool-context -Wno-error=3Dmemset-elt-size -W=
no-error=3Dnoexcept-type -Wno-error=3Dnonnull -Wno-error=3Dpointer-compare =
-Wno-error=3Dstringop-overflow -Wno-error=3Daggressive-loop-optimizations -=
Wno-error=3Dcast-function-type -Wno-error=3Dcatch-value -Wno-error=3Dmultis=
tatement-macros -Wno-error=3Drestrict -Wno-error=3Dsizeof-pointer-memaccess=
 -Wno-error=3Dstringop-truncation -Wno-return-type -Wno-address-of-packed-m=
ember    -c /workspace/src/contrib/libarchive/tar/test/test_symlink_dir.c -=
o test_symlink_dir.o
--- functional_test ---
echo '#! /usr/libexec/atf-sh' > functional_test.tmp
cat /workspace/src/usr.bin/tar/tests/functional_test.sh >>functional_test.t=
mp
chmod +x functional_test.tmp
mv functional_test.tmp functional_test
--- bsdtar.1.gz ---
gzip -cn /workspace/src/contrib/libarchive/tar/bsdtar.1 > bsdtar.1.gz
--- all_subdir_usr.bin/tar/tests ---
--- Kyuafile ---
--- bsdtar.debug ---
/usr/local/x86_64-unknown-freebsd13.1/bin/objcopy --only-keep-debug bsdtar.=
full bsdtar.debug
--- all_subdir_lib ---
--- all_subdir_lib/libmilter ---
=3D=3D=3D> lib/libmilter (all)
--- all_subdir_usr.bin ---
--- all_subdir_usr.bin/tar/tests ---
--- bsdtar_test ---
--- test_version.o ---
/usr/local/bin/x86_64-unknown-freebsd13.1-gcc12 --sysroot=3D/tmp/obj/worksp=
ace/src/amd64.amd64/tmp -B/usr/local/x86_64-unknown-freebsd13.1/bin/  -O2 -=
pipe -fno-common -DPLATFORM_CONFIG_H=3D\"/workspace/src/lib/libarchive/conf=
ig_freebsd.h\" -I/workspace/src/lib/libarchive -I/tmp/obj/workspace/src/amd=
64.amd64/usr.bin/tar/tests -I/workspace/src/contrib/libarchive/libarchive -=
I/workspace/src/contrib/libarchive/tar -I/workspace/src/contrib/libarchive/=
tar/test -I/workspace/src/contrib/libarchive/test_utils   -fPIE -g -MD  -MF=
.depend.bsdtar_test.test_version.o -MTtest_version.o -std=3Dgnu99 -Wno-form=
at-zero-length -fstack-protector-strong -Wsystem-headers -Werror -Wall -Wno=
-format-y2k -W -Wno-unused-parameter -Wmissing-prototypes -Wpointer-arith -=
Wno-uninitialized -Wno-pointer-sign -Wdate-time -Wno-error=3Daddress -Wno-e=
rror=3Darray-bounds -Wno-error=3Dattributes -Wno-error=3Dbool-compare -Wno-=
error=3Dcast-align -Wno-error=3Dclobbered -Wno-error=3Ddeprecated-declarati=
ons -Wno-error=3Denum-compare -Wno-error=3Dextra -Wno-error=3Dlogical-not-p=
arentheses -Wno-error=3Dstrict-aliasing -Wno-error=3Duninitialized -Wno-err=
or=3Dunused-but-set-variable -Wno-error=3Dunused-function -Wno-error=3Dunus=
ed-value -Wno-error=3Dempty-body -Wno-error=3Dmaybe-uninitialized -Wno-erro=
r=3Dnonnull-compare -Wno-error=3Dshift-negative-value -Wno-error=3Dtautolog=
ical-compare -Wno-error=3Dunused-const-variable -Wno-error=3Dbool-operation=
 -Wno-error=3Ddeprecated -Wno-error=3Dexpansion-to-defined -Wno-error=3Dfor=
mat-overflow -Wno-error=3Dformat-truncation -Wno-error=3Dimplicit-fallthrou=
gh -Wno-error=3Dint-in-bool-context -Wno-error=3Dmemset-elt-size -Wno-error=
=3Dnoexcept-type -Wno-error=3Dnonnull -Wno-error=3Dpointer-compare -Wno-err=
or=3Dstringop-overflow -Wno-error=3Daggressive-loop-optimizations -Wno-erro=
r=3Dcast-function-type -Wno-error=3Dcatch-value -Wno-error=3Dmultistatement=
-macros -Wno-error=3Drestrict -Wno-error=3Dsizeof-pointer-memaccess -Wno-er=
ror=3Dstringop-truncation -Wno-return-type -Wno-address-of-packed-member   =
 -c /workspace/src/contrib/libarchive/tar/test/test_version.c -o test_versi=
on.o
--- all_subdir_lib ---
--- all_subdir_lib/googletest ---
--- all_subdir_lib/googletest/tests/gmock_main ---
--- gmock-nice-strict_test ---
--- all_subdir_usr.sbin ---
--- all_subdir_usr.sbin/acpi ---
--- rsserial.o ---
--- all_subdir_lib ---
(cd /workspace/src/lib/googletest/tests/gmock_main &&  DEPENDFILE=3D.depend=
.gmock-nice-strict_test  NO_SUBDIR=3D1 make -f /workspace/src/lib/googletes=
t/tests/gmock_main/Makefile _RECURSING_PROGS=3Dt  PROG=3Dgmock-nice-strict_=
test PROG_CXX=3Dgmock-nice-strict_test)
--- all_subdir_usr.sbin ---
/usr/local/bin/x86_64-unknown-freebsd13.1-gcc12 --sysroot=3D/tmp/obj/worksp=
ace/src/amd64.amd64/tmp -B/usr/local/x86_64-unknown-freebsd13.1/bin/  -O2 -=
pipe -fno-common -DACPI_DB_APP -DACPI_EXEC_APP -fno-strict-aliasing   -I/wo=
rkspace/src/sys -fPIE -g -MD  -MF.depend.rsserial.o -MTrsserial.o -std=3Dgn=
u99 -Wno-format-zero-length -fstack-protector-strong -Wsystem-headers -Werr=
or -Wall -Wno-format-y2k -W -Wno-unused-parameter -Wmissing-prototypes -Wpo=
inter-arith -Wno-uninitialized -Wno-pointer-sign -Wdate-time -Wno-error=3Da=
ddress -Wno-error=3Darray-bounds -Wno-error=3Dattributes -Wno-error=3Dbool-=
compare -Wno-error=3Dcast-align -Wno-error=3Dclobbered -Wno-error=3Ddepreca=
ted-declarations -Wno-error=3Denum-compare -Wno-error=3Dextra -Wno-error=3D=
logical-not-parentheses -Wno-error=3Dstrict-aliasing -Wno-error=3Duninitial=
ized -Wno-error=3Dunused-but-set-variable -Wno-error=3Dunused-function -Wno=
-error=3Dunused-value -Wno-error=3Dempty-body -Wno-error=3Dmaybe-uninitiali=
zed -Wno-error=3Dnonnull-compare -Wno-error=3Dshift-negative-value -Wno-err=
or=3Dtautological-compare -Wno-error=3Dunused-const-variable -Wno-error=3Db=
ool-operation -Wno-error=3Ddeprecated -Wno-error=3Dexpansion-to-defined -Wn=
o-error=3Dformat-overflow -Wno-error=3Dformat-truncation -Wno-error=3Dimpli=
cit-fallthrough -Wno-error=3Dint-in-bool-context -Wno-error=3Dmemset-elt-si=
ze -Wno-error=3Dnoexcept-type -Wno-error=3Dnonnull -Wno-error=3Dpointer-com=
pare -Wno-error=3Dstringop-overflow -Wno-error=3Daggressive-loop-optimizati=
ons -Wno-error=3Dcast-function-type -Wno-error=3Dcatch-value -Wno-error=3Dm=
ultistatement-macros -Wno-error=3Drestrict -Wno-error=3Dsizeof-pointer-mema=
ccess -Wno-error=3Dstringop-truncation -Wno-return-type -Wno-address-of-pac=
ked-member      -c /workspace/src/sys/contrib/dev/acpica/components/resourc=
es/rsserial.c -o rsserial.o
--- all_subdir_usr.bin ---
--- test_main.o ---
/usr/local/bin/x86_64-unknown-freebsd13.1-gcc12 --sysroot=3D/tmp/obj/worksp=
ace/src/amd64.amd64/tmp -B/usr/local/x86_64-unknown-freebsd13.1/bin/  -O2 -=
pipe -fno-common -DPLATFORM_CONFIG_H=3D\"/workspace/src/lib/libarchive/conf=
ig_freebsd.h\" -I/workspace/src/lib/libarchive -I/tmp/obj/workspace/src/amd=
64.amd64/usr.bin/tar/tests -I/workspace/src/contrib/libarchive/libarchive -=
I/workspace/src/contrib/libarchive/tar -I/workspace/src/contrib/libarchive/=
tar/test -I/workspace/src/contrib/libarchive/test_utils   -fPIE -g -MD  -MF=
.depend.bsdtar_test.test_main.o -MTtest_main.o -std=3Dgnu99 -Wno-format-zer=
o-length -fstack-protector-strong -Wsystem-headers -Werror -Wall -Wno-forma=
t-y2k -W -Wno-unused-parameter -Wmissing-prototypes -Wpointer-arith -Wno-un=
initialized -Wno-pointer-sign -Wdate-time -Wno-error=3Daddress -Wno-error=
=3Darray-bounds -Wno-error=3Dattributes -Wno-error=3Dbool-compare -Wno-erro=
r=3Dcast-align -Wno-error=3Dclobbered -Wno-error=3Ddeprecated-declarations =
-Wno-error=3Denum-compare -Wno-error=3Dextra -Wno-error=3Dlogical-not-paren=
theses -Wno-error=3Dstrict-aliasing -Wno-error=3Duninitialized -Wno-error=
=3Dunused-but-set-variable -Wno-error=3Dunused-function -Wno-error=3Dunused=
-value -Wno-error=3Dempty-body -Wno-error=3Dmaybe-uninitialized -Wno-error=
=3Dnonnull-compare -Wno-error=3Dshift-negative-value -Wno-error=3Dtautologi=
cal-compare -Wno-error=3Dunused-const-variable -Wno-error=3Dbool-operation =
-Wno-error=3Ddeprecated -Wno-error=3Dexpansion-to-defined -Wno-error=3Dform=
at-overflow -Wno-error=3Dformat-truncation -Wno-error=3Dimplicit-fallthroug=
h -Wno-error=3Dint-in-bool-context -Wno-error=3Dmemset-elt-size -Wno-error=
=3Dnoexcept-type -Wno-error=3Dnonnull -Wno-error=3Dpointer-compare -Wno-err=
or=3Dstringop-overflow -Wno-error=3Daggressive-loop-optimizations -Wno-erro=
r=3Dcast-function-type -Wno-error=3Dcatch-value -Wno-error=3Dmultistatement=
-macros -Wno-error=3Drestrict -Wno-error=3Dsizeof-pointer-memaccess -Wno-er=
ror=3Dstringop-truncation -Wno-return-type -Wno-address-of-packed-member   =
 -c /workspace/src/contrib/libarchive/test_utils/test_main.c -o test_main.o
--- all_subdir_lib ---
--- .depend.gmock-nice-strict_test ---
echo gmock-nice-strict_test: /tmp/obj/workspace/src/amd64.amd64/tmp/usr/lib=
/libc.a /tmp/obj/workspace/src/amd64.amd64/tmp/usr/lib/libprivategmock_main=
.a /tmp/obj/workspace/src/amd64.amd64/tmp/usr/lib/libprivategmock.a /tmp/ob=
j/workspace/src/amd64.amd64/tmp/usr/lib/libprivategtest.a /tmp/obj/workspac=
e/src/amd64.amd64/tmp/usr/lib/libprivategmock.a /tmp/obj/workspace/src/amd6=
4.amd64/tmp/usr/lib/libprivategtest.a /tmp/obj/workspace/src/amd64.amd64/tm=
p/usr/lib/libprivategtest.a >> .depend.gmock-nice-strict_test
echo gmock-nice-strict_test: /tmp/obj/workspace/src/amd64.amd64/tmp/usr/lib=
/libc++.a >> .depend.gmock-nice-strict_test
--- gmock-nice-strict_test.o ---
/usr/local/bin/x86_64-unknown-freebsd13.1-g++12  --sysroot=3D/tmp/obj/works=
pace/src/amd64.amd64/tmp -B/usr/local/x86_64-unknown-freebsd13.1/bin/  -O2 =
-pipe -fno-common -fPIE -MD -MF.depend.gmock-nice-strict_test.gmock-nice-st=
rict_test.o -MTgmock-nice-strict_test.o -Wno-format-zero-length -fstack-pro=
tector-strong -Wsystem-headers -Wall -Wno-format-y2k -W -Wno-unused-paramet=
er -Wpointer-arith -Wreturn-type -Wcast-qual -Wwrite-strings -Wswitch -Wsha=
dow -Wunused-parameter -Wcast-align -Wchar-subscripts -Wdate-time -Wno-erro=
r=3Daddress -Wno-error=3Darray-bounds -Wno-error=3Dattributes -Wno-error=3D=
bool-compare -Wno-error=3Dcast-align -Wno-error=3Dclobbered -Wno-error=3Dde=
precated-declarations -Wno-error=3Denum-compare -Wno-error=3Dextra -Wno-err=
or=3Dlogical-not-parentheses -Wno-error=3Dstrict-aliasing -Wno-error=3Dunin=
itialized -Wno-error=3Dunused-but-set-variable -Wno-error=3Dunused-function=
 -Wno-error=3Dunused-value -Wno-error=3Dempty-body -Wno-error=3Dmaybe-unini=
tialized -Wno-error=3Dnonnull-compare -Wno-error=3Dshift-negative-value -Wn=
o-error=3Dtautological-compare -Wno-error=3Dunused-const-variable -Wno-erro=
r=3Dbool-operation -Wno-error=3Ddeprecated -Wno-error=3Dexpansion-to-define=
d -Wno-error=3Dformat-overflow -Wno-error=3Dformat-truncation -Wno-error=3D=
implicit-fallthrough -Wno-error=3Dint-in-bool-context -Wno-error=3Dmemset-e=
lt-size -Wno-error=3Dnoexcept-type -Wno-error=3Dnonnull -Wno-error=3Dpointe=
r-compare -Wno-error=3Dstringop-overflow -Wno-error=3Daggressive-loop-optim=
izations -Wno-error=3Dcast-function-type -Wno-error=3Dcatch-value -Wno-erro=
r=3Dmultistatement-macros -Wno-error=3Drestrict -Wno-error=3Dsizeof-pointer=
-memaccess -Wno-error=3Dstringop-truncation -Wno-return-type  -I/tmp/obj/wo=
rkspace/src/amd64.amd64/tmp/usr/include/private  -I/workspace/src/contrib/g=
oogletest/googlemock/include -I/workspace/src/contrib/googletest/googlemock=
 -I/workspace/src/contrib/googletest/googletest/include -I/workspace/src/co=
ntrib/googletest/googletest -I/tmp/obj/workspace/src/amd64.amd64/tmp/usr/in=
clude/private -DGTEST_HAS_POSIX_RE=3D1 -DGTEST_HAS_PTHREAD=3D1 -DGTEST_HAS_=
STREAM_REDIRECTION=3D1 -frtti -DGTEST_HAS_POSIX_RE=3D1 -DGTEST_HAS_PTHREAD=
=3D1 -DGTEST_HAS_STREAM_REDIRECTION=3D1 -frtti -fPIE -std=3Dc++11 -Wno-depr=
ecated-copy -Wno-literal-suffix -Wno-error=3Dunknown-pragmas     -c /worksp=
ace/src/contrib/googletest/googlemock/test/gmock-nice-strict_test.cc -o gmo=
ck-nice-strict_test.o
--- gmock-port_test ---
(cd /workspace/src/lib/googletest/tests/gmock_main &&  DEPENDFILE=3D.depend=
.gmock-port_test  NO_SUBDIR=3D1 make -f /workspace/src/lib/googletest/tests=
/gmock_main/Makefile _RECURSING_PROGS=3Dt  PROG=3Dgmock-port_test PROG_CXX=
=3Dgmock-port_test)
--- .depend.gmock-port_test ---
echo gmock-port_test: /tmp/obj/workspace/src/amd64.amd64/tmp/usr/lib/libc.a=
 /tmp/obj/workspace/src/amd64.amd64/tmp/usr/lib/libprivategmock_main.a /tmp=
/obj/workspace/src/amd64.amd64/tmp/usr/lib/libprivategmock.a /tmp/obj/works=
pace/src/amd64.amd64/tmp/usr/lib/libprivategtest.a /tmp/obj/workspace/src/a=
md64.amd64/tmp/usr/lib/libprivategmock.a /tmp/obj/workspace/src/amd64.amd64=
/tmp/usr/lib/libprivategtest.a /tmp/obj/workspace/src/amd64.amd64/tmp/usr/l=
ib/libprivategtest.a >> .depend.gmock-port_test
echo gmock-port_test: /tmp/obj/workspace/src/amd64.amd64/tmp/usr/lib/libc++=
.a >> .depend.gmock-port_test
--- gmock-port_test.o ---
/usr/local/bin/x86_64-unknown-freebsd13.1-g++12  --sysroot=3D/tmp/obj/works=
pace/src/amd64.amd64/tmp -B/usr/local/x86_64-unknown-freebsd13.1/bin/  -O2 =
-pipe -fno-common -fPIE -MD -MF.depend.gmock-port_test.gmock-port_test.o -M=
Tgmock-port_test.o -Wno-format-zero-length -fstack-protector-strong -Wsyste=
m-headers -Wall -Wno-format-y2k -W -Wno-unused-parameter -Wpointer-arith -W=
return-type -Wcast-qual -Wwrite-strings -Wswitch -Wshadow -Wunused-paramete=
r -Wcast-align -Wchar-subscripts -Wdate-time -Wno-error=3Daddress -Wno-erro=
r=3Darray-bounds -Wno-error=3Dattributes -Wno-error=3Dbool-compare -Wno-err=
or=3Dcast-align -Wno-error=3Dclobbered -Wno-error=3Ddeprecated-declarations=
 -Wno-error=3Denum-compare -Wno-error=3Dextra -Wno-error=3Dlogical-not-pare=
ntheses -Wno-error=3Dstrict-aliasing -Wno-error=3Duninitialized -Wno-error=
=3Dunused-but-set-variable -Wno-error=3Dunused-function -Wno-error=3Dunused=
-value -Wno-error=3Dempty-body -Wno-error=3Dmaybe-uninitialized -Wno-error=
=3Dnonnull-compare -Wno-error=3Dshift-negative-value -Wno-error=3Dtautologi=
cal-compare -Wno-error=3Dunused-const-variable -Wno-error=3Dbool-operation =
-Wno-error=3Ddeprecated -Wno-error=3Dexpansion-to-defined -Wno-error=3Dform=
at-overflow -Wno-error=3Dformat-truncation -Wno-error=3Dimplicit-fallthroug=
h -Wno-error=3Dint-in-bool-context -Wno-error=3Dmemset-elt-size -Wno-error=
=3Dnoexcept-type -Wno-error=3Dnonnull -Wno-error=3Dpointer-compare -Wno-err=
or=3Dstringop-overflow -Wno-error=3Daggressive-loop-optimizations -Wno-erro=
r=3Dcast-function-type -Wno-error=3Dcatch-value -Wno-error=3Dmultistatement=
-macros -Wno-error=3Drestrict -Wno-error=3Dsizeof-pointer-memaccess -Wno-er=
ror=3Dstringop-truncation -Wno-return-type  -I/tmp/obj/workspace/src/amd64.=
amd64/tmp/usr/include/private  -I/workspace/src/contrib/googletest/googlemo=
ck/include -I/workspace/src/contrib/googletest/googlemock -I/workspace/src/=
contrib/googletest/googletest/include -I/workspace/src/contrib/googletest/g=
oogletest -I/tmp/obj/workspace/src/amd64.amd64/tmp/usr/include/private -DGT=
EST_HAS_POSIX_RE=3D1 -DGTEST_HAS_PTHREAD=3D1 -DGTEST_HAS_STREAM_REDIRECTION=
=3D1 -frtti -DGTEST_HAS_POSIX_RE=3D1 -DGTEST_HAS_PTHREAD=3D1 -DGTEST_HAS_ST=
REAM_REDIRECTION=3D1 -frtti -fPIE -std=3Dc++11 -Wno-deprecated-copy -Wno-li=
teral-suffix -Wno-error=3Dunknown-pragmas     -c /workspace/src/contrib/goo=
gletest/googlemock/test/gmock-port_test.cc -o gmock-port_test.o
--- all_subdir_usr.sbin ---
--- rsutils.o ---
/usr/local/bin/x86_64-unknown-freebsd13.1-gcc12 --sysroot=3D/tmp/obj/worksp=
ace/src/amd64.amd64/tmp -B/usr/local/x86_64-unknown-freebsd13.1/bin/  -O2 -=
pipe -fno-common -DACPI_DB_APP -DACPI_EXEC_APP -fno-strict-aliasing   -I/wo=
rkspace/src/sys -fPIE -g -MD  -MF.depend.rsutils.o -MTrsutils.o -std=3Dgnu9=
9 -Wno-format-zero-length -fstack-protector-strong -Wsystem-headers -Werror=
 -Wall -Wno-format-y2k -W -Wno-unused-parameter -Wmissing-prototypes -Wpoin=
ter-arith -Wno-uninitialized -Wno-pointer-sign -Wdate-time -Wno-error=3Dadd=
ress -Wno-error=3Darray-bounds -Wno-error=3Dattributes -Wno-error=3Dbool-co=
mpare -Wno-error=3Dcast-align -Wno-error=3Dclobbered -Wno-error=3Ddeprecate=
d-declarations -Wno-error=3Denum-compare -Wno-error=3Dextra -Wno-error=3Dlo=
gical-not-parentheses -Wno-error=3Dstrict-aliasing -Wno-error=3Duninitializ=
ed -Wno-error=3Dunused-but-set-variable -Wno-error=3Dunused-function -Wno-e=
rror=3Dunused-value -Wno-error=3Dempty-body -Wno-error=3Dmaybe-uninitialize=
d -Wno-error=3Dnonnull-compare -Wno-error=3Dshift-negative-value -Wno-error=
=3Dtautological-compare -Wno-error=3Dunused-const-variable -Wno-error=3Dboo=
l-operation -Wno-error=3Ddeprecated -Wno-error=3Dexpansion-to-defined -Wno-=
error=3Dformat-overflow -Wno-error=3Dformat-truncation -Wno-error=3Dimplici=
t-fallthrough -Wno-error=3Dint-in-bool-context -Wno-error=3Dmemset-elt-size=
 -Wno-error=3Dnoexcept-type -Wno-error=3Dnonnull -Wno-error=3Dpointer-compa=
re -Wno-error=3Dstringop-overflow -Wno-error=3Daggressive-loop-optimization=
s -Wno-error=3Dcast-function-type -Wno-error=3Dcatch-value -Wno-error=3Dmul=
tistatement-macros -Wno-error=3Drestrict -Wno-error=3Dsizeof-pointer-memacc=
ess -Wno-error=3Dstringop-truncation -Wno-return-type -Wno-address-of-packe=
d-member      -c /workspace/src/sys/contrib/dev/acpica/components/resources=
/rsutils.c -o rsutils.o
--- all_subdir_usr.sbin/bhyve ---
--- all_subdir_usr.sbin/bhyve/kbdlayout ---
=3D=3D=3D> usr.sbin/bhyve/kbdlayout (all)
--- bhyve.8.gz ---
gzip -cn /workspace/src/usr.sbin/bhyve/bhyve.8 > bhyve.8.gz
--- bhyve_config.5.gz ---
gzip -cn /workspace/src/usr.sbin/bhyve/bhyve_config.5 > bhyve_config.5.gz
--- bhyve.full ---
/usr/local/bin/x86_64-unknown-freebsd13.1-gcc12 --sysroot=3D/tmp/obj/worksp=
ace/src/amd64.amd64/tmp -B/usr/local/x86_64-unknown-freebsd13.1/bin/ -O2 -p=
ipe -fno-common -I/workspace/src/usr.sbin/bhyve/../../contrib/lib9p -I/work=
space/src/sys -DINET -DINET6 -DNETGRAPH -I/workspace/src/sys/dev/e1000 -I/w=
orkspace/src/sys/dev/mii -I/workspace/src/sys/dev/usb/controller -fPIE -g -=
std=3Dgnu99 -Wno-format-zero-length -fstack-protector-strong -Wsystem-heade=
rs -Werror -Wall -Wno-format-y2k -W -Wno-unused-parameter -Wmissing-prototy=
pes -Wpointer-arith -Wreturn-type -Wcast-qual -Wwrite-strings -Wswitch -Wsh=
adow -Wunused-parameter -Wchar-subscripts -Wnested-externs -Wold-style-defi=
nition -Wno-pointer-sign -Wdate-time -Wno-error=3Daddress -Wno-error=3Darra=
y-bounds -Wno-error=3Dattributes -Wno-error=3Dbool-compare -Wno-error=3Dcas=
t-align -Wno-error=3Dclobbered -Wno-error=3Ddeprecated-declarations -Wno-er=
ror=3Denum-compare -Wno-error=3Dextra -Wno-error=3Dlogical-not-parentheses =
-Wno-error=3Dstrict-aliasing -Wno-error=3Duninitialized -Wno-error=3Dunused=
-but-set-variable -Wno-error=3Dunused-function -Wno-error=3Dunused-value -W=
no-error=3Dempty-body -Wno-error=3Dmaybe-uninitialized -Wno-error=3Dnonnull=
-compare -Wno-error=3Dshift-negative-value -Wno-error=3Dtautological-compar=
e -Wno-error=3Dunused-const-variable -Wno-error=3Dbool-operation -Wno-error=
=3Ddeprecated -Wno-error=3Dexpansion-to-defined -Wno-error=3Dformat-overflo=
w -Wno-error=3Dformat-truncation -Wno-error=3Dimplicit-fallthrough -Wno-err=
or=3Dint-in-bool-context -Wno-error=3Dmemset-elt-size -Wno-error=3Dnoexcept=
-type -Wno-error=3Dnonnull -Wno-error=3Dpointer-compare -Wno-error=3Dstring=
op-overflow -Wno-error=3Daggressive-loop-optimizations -Wno-error=3Dcast-fu=
nction-type -Wno-error=3Dcatch-value -Wno-error=3Dmultistatement-macros -Wn=
o-error=3Drestrict -Wno-error=3Dsizeof-pointer-memaccess -Wno-error=3Dstrin=
gop-truncation -Wno-return-type  -Wl,-zrelro -pie   -o bhyve.full acpi_devi=
ce.o atkbdc.o acpi.o audio.o basl.o bhyvegc.o bhyverun.o block_if.o bootrom=
.o config.o console.o ctl_util.o ctl_scsi_all.o fwctl.o gdb.o hda_codec.o i=
nout.o ioapic.o kernemu_dev.o mem.o mevent.o mptbl.o net_backends.o net_uti=
ls.o pci_ahci.o pci_e82545.o pci_emul.o pci_hda.o pci_fbuf.o pci_hostbridge=
.o pci_irq.o pci_lpc.o pci_nvme.o pci_passthru.o pci_virtio_9p.o pci_virtio=
_block.o pci_virtio_console.o pci_virtio_input.o pci_virtio_net.o pci_virti=
o_rnd.o pci_virtio_scsi.o pci_uart.o pci_xhci.o pctestdev.o pm.o post.o ps2=
kbd.o ps2mouse.o qemu_fwcfg.o rfb.o rtc.o smbiostbl.o sockstream.o task_swi=
tch.o uart_emul.o usb_emul.o usb_mouse.o virtio.o vga.o vmgenc.o xmsr.o spi=
nup_ap.o iov.o vmm_instruction_emul.o   -lvmmapi  -lmd  -lnv   -lz  -lutil =
 -lsbuf  -lcam  -l9p  -lnetgraph  -lcrypto -lpthread=20
--- all_subdir_lib ---
--- all_subdir_lib/googletest/tests/gtest ---
--- gtest_stress_test ---
--- gtest_stress_test ---
/usr/local/bin/x86_64-unknown-freebsd13.1-g++12 --sysroot=3D/tmp/obj/worksp=
ace/src/amd64.amd64/tmp -B/usr/local/x86_64-unknown-freebsd13.1/bin/ -O2 -p=
ipe -fno-common -fPIE -Wno-format-zero-length -fstack-protector-strong -Wsy=
stem-headers -Wall -Wno-format-y2k -W -Wno-unused-parameter -Wpointer-arith=
 -Wreturn-type -Wcast-qual -Wwrite-strings -Wswitch -Wshadow -Wunused-param=
eter -Wcast-align -Wchar-subscripts -Wdate-time -Wno-error=3Daddress -Wno-e=
rror=3Darray-bounds -Wno-error=3Dattributes -Wno-error=3Dbool-compare -Wno-=
error=3Dcast-align -Wno-error=3Dclobbered -Wno-error=3Ddeprecated-declarati=
ons -Wno-error=3Denum-compare -Wno-error=3Dextra -Wno-error=3Dlogical-not-p=
arentheses -Wno-error=3Dstrict-aliasing -Wno-error=3Duninitialized -Wno-err=
or=3Dunused-but-set-variable -Wno-error=3Dunused-function -Wno-error=3Dunus=
ed-value -Wno-error=3Dempty-body -Wno-error=3Dmaybe-uninitialized -Wno-erro=
r=3Dnonnull-compare -Wno-error=3Dshift-negative-value -Wno-error=3Dtautolog=
ical-compare -Wno-error=3Dunused-const-variable -Wno-error=3Dbool-operation=
 -Wno-error=3Ddeprecated -Wno-error=3Dexpansion-to-defined -Wno-error=3Dfor=
mat-overflow -Wno-error=3Dformat-truncation -Wno-error=3Dimplicit-fallthrou=
gh -Wno-error=3Dint-in-bool-context -Wno-error=3Dmemset-elt-size -Wno-error=
=3Dnoexcept-type -Wno-error=3Dnonnull -Wno-error=3Dpointer-compare -Wno-err=
or=3Dstringop-overflow -Wno-error=3Daggressive-loop-optimizations -Wno-erro=
r=3Dcast-function-type -Wno-error=3Dcatch-value -Wno-error=3Dmultistatement=
-macros -Wno-error=3Drestrict -Wno-error=3Dsizeof-pointer-memaccess -Wno-er=
ror=3Dstringop-truncation -Wno-return-type -I/tmp/obj/workspace/src/amd64.a=
md64/tmp/usr/include/private -I/workspace/src/contrib/googletest/googletest=
/include -I/workspace/src/contrib/googletest/googletest -I/tmp/obj/workspac=
e/src/amd64.amd64/tmp/usr/include/private -DGTEST_HAS_POSIX_RE=3D1 -DGTEST_=
HAS_PTHREAD=3D1 -DGTEST_HAS_STREAM_REDIRECTION=3D1 -frtti -DGTEST_HAS_POSIX=
_RE=3D1 -DGTEST_HAS_PTHREAD=3D1 -DGTEST_HAS_STREAM_REDIRECTION=3D1 -frtti -=
fPIE -std=3Dc++11 -Wno-deprecated-copy -Wno-literal-suffix -Wno-error=3Dunk=
nown-pragmas  -Wl,-zrelro -pie  -o gtest_stress_test  gtest_stress_test.o -=
lprivategtest  -lpthread
--- gtest-unittest-api_test ---
(cd /workspace/src/lib/googletest/tests/gtest &&  DEPENDFILE=3D.depend.gtes=
t-unittest-api_test  NO_SUBDIR=3D1 make -f /workspace/src/lib/googletest/te=
sts/gtest/Makefile _RECURSING_PROGS=3Dt  PROG=3Dgtest-unittest-api_test PRO=
G_CXX=3Dgtest-unittest-api_test)
--- all_subdir_usr.sbin ---
--- all_subdir_usr.sbin/acpi ---
--- rsxface.o ---
/usr/local/bin/x86_64-unknown-freebsd13.1-gcc12 --sysroot=3D/tmp/obj/worksp=
ace/src/amd64.amd64/tmp -B/usr/local/x86_64-unknown-freebsd13.1/bin/  -O2 -=
pipe -fno-common -DACPI_DB_APP -DACPI_EXEC_APP -fno-strict-aliasing   -I/wo=
rkspace/src/sys -fPIE -g -MD  -MF.depend.rsxface.o -MTrsxface.o -std=3Dgnu9=
9 -Wno-format-zero-length -fstack-protector-strong -Wsystem-headers -Werror=
 -Wall -Wno-format-y2k -W -Wno-unused-parameter -Wmissing-prototypes -Wpoin=
ter-arith -Wno-uninitialized -Wno-pointer-sign -Wdate-time -Wno-error=3Dadd=
ress -Wno-error=3Darray-bounds -Wno-error=3Dattributes -Wno-error=3Dbool-co=
mpare -Wno-error=3Dcast-align -Wno-error=3Dclobbered -Wno-error=3Ddeprecate=
d-declarations -Wno-error=3Denum-compare -Wno-error=3Dextra -Wno-error=3Dlo=
gical-not-parentheses -Wno-error=3Dstrict-aliasing -Wno-error=3Duninitializ=
ed -Wno-error=3Dunused-but-set-variable -Wno-error=3Dunused-function -Wno-e=
rror=3Dunused-value -Wno-error=3Dempty-body -Wno-error=3Dmaybe-uninitialize=
d -Wno-error=3Dnonnull-compare -Wno-error=3Dshift-negative-value -Wno-error=
=3Dtautological-compare -Wno-error=3Dunused-const-variable -Wno-error=3Dboo=
l-operation -Wno-error=3Ddeprecated -Wno-error=3Dexpansion-to-defined -Wno-=
error=3Dformat-overflow -Wno-error=3Dformat-truncation -Wno-error=3Dimplici=
t-fallthrough -Wno-error=3Dint-in-bool-context -Wno-error=3Dmemset-elt-size=
 -Wno-error=3Dnoexcept-type -Wno-error=3Dnonnull -Wno-error=3Dpointer-compa=
re -Wno-error=3Dstringop-overflow -Wno-error=3Daggressive-loop-optimization=
s -Wno-error=3Dcast-function-type -Wno-error=3Dcatch-value -Wno-error=3Dmul=
tistatement-macros -Wno-error=3Drestrict -Wno-error=3Dsizeof-pointer-memacc=
ess -Wno-error=3Dstringop-truncation -Wno-return-type -Wno-address-of-packe=
d-member      -c /workspace/src/sys/contrib/dev/acpica/components/resources=
/rsxface.c -o rsxface.o
--- all_subdir_lib ---
--- .depend.gtest-unittest-api_test ---
echo gtest-unittest-api_test: /tmp/obj/workspace/src/amd64.amd64/tmp/usr/li=
b/libc.a /tmp/obj/workspace/src/amd64.amd64/tmp/usr/lib/libprivategtest.a >=
> .depend.gtest-unittest-api_test
echo gtest-unittest-api_test: /tmp/obj/workspace/src/amd64.amd64/tmp/usr/li=
b/libc++.a >> .depend.gtest-unittest-api_test
--- gtest-unittest-api_test.o ---
/usr/local/bin/x86_64-unknown-freebsd13.1-g++12  --sysroot=3D/tmp/obj/works=
pace/src/amd64.amd64/tmp -B/usr/local/x86_64-unknown-freebsd13.1/bin/  -O2 =
-pipe -fno-common -fPIE -MD -MF.depend.gtest-unittest-api_test.gtest-unitte=
st-api_test.o -MTgtest-unittest-api_test.o -Wno-format-zero-length -fstack-=
protector-strong -Wsystem-headers -Wall -Wno-format-y2k -W -Wno-unused-para=
meter -Wpointer-arith -Wreturn-type -Wcast-qual -Wwrite-strings -Wswitch -W=
shadow -Wunused-parameter -Wcast-align -Wchar-subscripts -Wdate-time -Wno-e=
rror=3Daddress -Wno-error=3Darray-bounds -Wno-error=3Dattributes -Wno-error=
=3Dbool-compare -Wno-error=3Dcast-align -Wno-error=3Dclobbered -Wno-error=
=3Ddeprecated-declarations -Wno-error=3Denum-compare -Wno-error=3Dextra -Wn=
o-error=3Dlogical-not-parentheses -Wno-error=3Dstrict-aliasing -Wno-error=
=3Duninitialized -Wno-error=3Dunused-but-set-variable -Wno-error=3Dunused-f=
unction -Wno-error=3Dunused-value -Wno-error=3Dempty-body -Wno-error=3Dmayb=
e-uninitialized -Wno-error=3Dnonnull-compare -Wno-error=3Dshift-negative-va=
lue -Wno-error=3Dtautological-compare -Wno-error=3Dunused-const-variable -W=
no-error=3Dbool-operation -Wno-error=3Ddeprecated -Wno-error=3Dexpansion-to=
-defined -Wno-error=3Dformat-overflow -Wno-error=3Dformat-truncation -Wno-e=
rror=3Dimplicit-fallthrough -Wno-error=3Dint-in-bool-context -Wno-error=3Dm=
emset-elt-size -Wno-error=3Dnoexcept-type -Wno-error=3Dnonnull -Wno-error=
=3Dpointer-compare -Wno-error=3Dstringop-overflow -Wno-error=3Daggressive-l=
oop-optimizations -Wno-error=3Dcast-function-type -Wno-error=3Dcatch-value =
-Wno-error=3Dmultistatement-macros -Wno-error=3Drestrict -Wno-error=3Dsizeo=
f-pointer-memaccess -Wno-error=3Dstringop-truncation -Wno-return-type  -I/t=
mp/obj/workspace/src/amd64.amd64/tmp/usr/include/private  -I/workspace/src/=
contrib/googletest/googletest/include -I/workspace/src/contrib/googletest/g=
oogletest -I/tmp/obj/workspace/src/amd64.amd64/tmp/usr/include/private -DGT=
EST_HAS_POSIX_RE=3D1 -DGTEST_HAS_PTHREAD=3D1 -DGTEST_HAS_STREAM_REDIRECTION=
=3D1 -frtti -DGTEST_HAS_POSIX_RE=3D1 -DGTEST_HAS_PTHREAD=3D1 -DGTEST_HAS_ST=
REAM_REDIRECTION=3D1 -frtti -fPIE -std=3Dc++11 -Wno-deprecated-copy -Wno-li=
teral-suffix -Wno-error=3Dunknown-pragmas     -c /workspace/src/contrib/goo=
gletest/googletest/test/gtest-unittest-api_test.cc -o gtest-unittest-api_te=
st.o
--- all_subdir_usr.sbin ---
--- all_subdir_usr.sbin/bhyve ---
/usr/local/bin/x86_64-unknown-freebsd13.1-ld: warning: libcap_pwd.so.1, nee=
ded by /tmp/obj/workspace/src/amd64.amd64/tmp/usr/lib/lib9p.so, not found (=
try using -rpath or -rpath-link)
/usr/local/bin/x86_64-unknown-freebsd13.1-ld: warning: libcap_grp.so.1, nee=
ded by /tmp/obj/workspace/src/amd64.amd64/tmp/usr/lib/lib9p.so, not found (=
try using -rpath or -rpath-link)
--- all_subdir_lib ---
--- all_subdir_lib/googletest/tests/gmock_main ---
--- gmock-nice-strict_test ---
In file included from /tmp/obj/workspace/src/amd64.amd64/tmp/usr/include/c+=
+/v1/map:535,
                 from /tmp/obj/workspace/src/amd64.amd64/tmp/usr/include/pr=
ivate/gmock/gmock-spec-builders.h:64,
                 from /tmp/obj/workspace/src/amd64.amd64/tmp/usr/include/pr=
ivate/gmock/gmock-generated-nice-strict.h:70,
                 from /workspace/src/contrib/googletest/googlemock/test/gmo=
ck-nice-strict_test.cc:31:
/tmp/obj/workspace/src/amd64.amd64/tmp/usr/include/c++/v1/__functional/bina=
ry_function.h:45:27: warning: 'template<class _Arg1, class _Arg2, class _Re=
sult> struct std::__1::binary_function' is deprecated [-Wdeprecated-declara=
tions]
   45 | using __binary_function =3D binary_function<_Arg1, _Arg2, _Result>;
      |                           ^~~~~~~~~~~~~~~
/tmp/obj/workspace/src/amd64.amd64/tmp/usr/include/c++/v1/__functional/bina=
ry_function.h:24:57: note: declared here
   24 | struct _LIBCPP_TEMPLATE_VIS _LIBCPP_DEPRECATED_IN_CXX11 binary_func=
tion
      |                                                         ^~~~~~~~~~~=
~~~~
In file included from /tmp/obj/workspace/src/amd64.amd64/tmp/usr/include/c+=
+/v1/__functional/operations.h:15,
                 from /tmp/obj/workspace/src/amd64.amd64/tmp/usr/include/c+=
+/v1/map:537:
/tmp/obj/workspace/src/amd64.amd64/tmp/usr/include/c++/v1/__functional/unar=
y_function.h:42:26: warning: 'template<class _Arg, class _Result> struct st=
d::__1::unary_function' is deprecated [-Wdeprecated-declarations]
   42 | using __unary_function =3D unary_function<_Arg, _Result>;
      |                          ^~~~~~~~~~~~~~
/tmp/obj/workspace/src/amd64.amd64/tmp/usr/include/c++/v1/__functional/unar=
y_function.h:23:57: note: declared here
   23 | struct _LIBCPP_TEMPLATE_VIS _LIBCPP_DEPRECATED_IN_CXX11 unary_funct=
ion
      |                                                         ^~~~~~~~~~~=
~~~
--- all_subdir_usr.sbin ---
/usr/local/bin/x86_64-unknown-freebsd13.1-ld: /tmp/obj/workspace/src/amd64.=
amd64/tmp/usr/lib/lib9p.so: undefined reference to `cap_setpassent'
/usr/local/bin/x86_64-unknown-freebsd13.1-ld: /tmp/obj/workspace/src/amd64.=
amd64/tmp/usr/lib/lib9p.so: undefined reference to `cap_getgrgid_r'
/usr/local/bin/x86_64-unknown-freebsd13.1-ld: /tmp/obj/workspace/src/amd64.=
amd64/tmp/usr/lib/lib9p.so: undefined reference to `cap_setgroupent'
/usr/local/bin/x86_64-unknown-freebsd13.1-ld: /tmp/obj/workspace/src/amd64.=
amd64/tmp/usr/lib/lib9p.so: undefined reference to `cap_getpwnam'
/usr/local/bin/x86_64-unknown-freebsd13.1-ld: /tmp/obj/workspace/src/amd64.=
amd64/tmp/usr/lib/lib9p.so: undefined reference to `cap_getpwuid_r'
collect2: error: ld returned 1 exit status
--- all_subdir_lib ---
--- gmock-port_test ---
In file included from /tmp/obj/workspace/src/amd64.amd64/tmp/usr/include/c+=
+/v1/memory:852,
                 from /tmp/obj/workspace/src/amd64.amd64/tmp/usr/include/c+=
+/v1/__locale:18,
                 from /tmp/obj/workspace/src/amd64.amd64/tmp/usr/include/c+=
+/v1/ios:221,
                 from /tmp/obj/workspace/src/amd64.amd64/tmp/usr/include/c+=
+/v1/iostream:41,
                 from /tmp/obj/workspace/src/amd64.amd64/tmp/usr/include/pr=
ivate/gmock/internal/gmock-port.h:45,
                 from /workspace/src/contrib/googletest/googlemock/test/gmo=
ck-port_test.cc:35:
/tmp/obj/workspace/src/amd64.amd64/tmp/usr/include/c++/v1/__memory/auto_ptr=
.h:39:60: warning: 'template<class _Tp> class std::__1::auto_ptr' is deprec=
ated [-Wdeprecated-declarations]
   39 |     template<class _Up> _LIBCPP_INLINE_VISIBILITY auto_ptr(auto_ptr=
<_Up>& __p) _NOEXCEPT
      |                                                            ^~~~~~~~
/tmp/obj/workspace/src/amd64.amd64/tmp/usr/include/c++/v1/__memory/auto_ptr=
.h:30:56: note: declared here
   30 | class _LIBCPP_TEMPLATE_VIS _LIBCPP_DEPRECATED_IN_CXX11 auto_ptr
      |                                                        ^~~~~~~~
/tmp/obj/workspace/src/amd64.amd64/tmp/usr/include/c++/v1/__memory/auto_ptr=
.h:43:71: warning: 'template<class _Tp> class std::__1::auto_ptr' is deprec=
ated [-Wdeprecated-declarations]
   43 |     template<class _Up> _LIBCPP_INLINE_VISIBILITY auto_ptr& operato=
r=3D(auto_ptr<_Up>& __p) _NOEXCEPT
      |                                                                    =
   ^~~~~~~~
/tmp/obj/workspace/src/amd64.amd64/tmp/usr/include/c++/v1/__memory/auto_ptr=
.h:30:56: note: declared here
   30 | class _LIBCPP_TEMPLATE_VIS _LIBCPP_DEPRECATED_IN_CXX11 auto_ptr
      |                                                        ^~~~~~~~
/tmp/obj/workspace/src/amd64.amd64/tmp/usr/include/c++/v1/__memory/auto_ptr=
.h:45:51: warning: 'template<class _Tp> struct std::__1::auto_ptr_ref' is d=
eprecated [-Wdeprecated-declarations]
   45 |     _LIBCPP_INLINE_VISIBILITY auto_ptr& operator=3D(auto_ptr_ref<_T=
p> __p) _NOEXCEPT
      |                                                   ^~~~~~~~~~~~
/tmp/obj/workspace/src/amd64.amd64/tmp/usr/include/c++/v1/__memory/auto_ptr=
.h:24:36: note: declared here
   24 | struct _LIBCPP_DEPRECATED_IN_CXX11 auto_ptr_ref
      |                                    ^~~~~~~~~~~~
--- all_subdir_usr.sbin ---
*** [bhyve.full] Error code 1

make[4]: stopped in /workspace/src/usr.sbin/bhyve
1 error

make[4]: stopped in /workspace/src/usr.sbin/bhyve
--- all_subdir_lib ---

make[2]: stopped in /workspace/src
--- all_subdir_tests ---

make[5]: stopped in /workspace/src/tests/sys/fs
--- all_subdir_usr.sbin ---

make[2]: stopped in /workspace/src
--- all_subdir_tests ---

make[4]: stopped in /workspace/src/tests/sys
--- all_subdir_usr.bin ---

make[2]: stopped in /workspace/src
--- all_subdir_tests ---

make[3]: stopped in /workspace/src/tests

make[2]: stopped in /workspace/src
      116.06 real      1062.64 user       127.50 sys

make[1]: stopped in /workspace/src

make: stopped in /workspace/src
Build step 'Execute shell' marked build as failure
[WARNINGS]Skipping publisher since build result is FAILURE
[PostBuildScript] - [INFO] Executing post build scripts.
[FreeBSD-main-amd64-gcc12_build] $ /bin/sh -xe /tmp/jenkins1377564804328632=
2572.sh
+ sh freebsd-ci/scripts/jail/clean.sh
clean jail FreeBSD-main-amd64-gcc12_build
Checking for post-build
Performing post-build step
Checking if email needs to be generated
Email was triggered for: Failure - Any
Sending email for trigger: Failure - Any
Sending mail from default account using System Admin e-mail address
------=_Part_1264_1763983061.1680096435754--



Want to link to this message? Use this URL: <https://mail-archive.FreeBSD.org/cgi/mid.cgi?1848240930.1265.1680096438013>