Skip site navigation (1)Skip section navigation (2)
Date:      Wed, 18 Oct 2023 16:39:55 +0000 (GMT)
From:      jenkins-admin@FreeBSD.org
To:        kp@FreeBSD.org, dev-ci@FreeBSD.org
Cc:        jenkins-admin@FreeBSD.org
Subject:   FreeBSD-stable-14-amd64-test - Build #115 - Still Unstable
Message-ID:  <1212429085.6494.1697647195639@jenkins.ci.freebsd.org>
In-Reply-To: <1777635179.6470.1697631878960@jenkins.ci.freebsd.org>
References:  <1777635179.6470.1697631878960@jenkins.ci.freebsd.org>

next in thread | previous in thread | raw e-mail | index | archive | help
------=_Part_6493_42585950.1697647195336
Content-Type: text/plain; charset=UTF-8
Content-Transfer-Encoding: 7bit

FreeBSD-stable-14-amd64-test - Build #115 (ce3ab9dfee304d335b4307c35e77407771d6cc3f) - Still Unstable

Build information: https://ci.FreeBSD.org/job/FreeBSD-stable-14-amd64-test/115/
Full change log: https://ci.FreeBSD.org/job/FreeBSD-stable-14-amd64-test/115/changes
Full build log: https://ci.FreeBSD.org/job/FreeBSD-stable-14-amd64-test/115/console

Status explanation:
"Unstable" - some tests are suspected being broken by the following changes
"Still Unstable" - the failing test cases have not been fixed by these
                   following changes and this is a notification to note that
                   these changes have not been fully tested by the CI system

Change summaries:
(Those commits are likely but not certainly responsible)

ce3ab9dfee304d335b4307c35e77407771d6cc3f by kp:
ifconfig: add static bridge addresses for vlan 0, not 1



The failed test cases:

9 tests failed.
FAILED:  sys.fs.fusefs.mknod.main

Error Message:
Returned non-success exit status 1

FAILED:  sys.netinet6.frag6.frag6_11.frag6_11

Error Message:
atf-check failed; see the output of the test for details

FAILED:  sys.netinet6.frag6.frag6_13.frag6_13

Error Message:
atf-check failed; see the output of the test for details

FAILED:  sys.netpfil.pf.ether.bridge_to

Error Message:
atf-check failed; see the output of the test for details

FAILED:  sys.netinet6.exthdr.exthdr

Error Message:
atf-check failed; see the output of the test for details

FAILED:  sys.netpfil.common.tos.pf_tos

Error Message:
atf-check failed; see the output of the test for details

FAILED:  usr.bin.file.file_test.contrib_file_tests

Error Message:
atf-check failed; see the output of the test for details

FAILED:  sys.fs.tmpfs.times_test.empty

Error Message:
Incorrect atime

FAILED:  sys.netlink.test_netlink_message_writer.py.__test_cases_list__

Error Message:
Test program did not exit cleanly
------=_Part_6493_42585950.1697647195336--



Want to link to this message? Use this URL: <https://mail-archive.FreeBSD.org/cgi/mid.cgi?1212429085.6494.1697647195639>