Date: Sat, 2 Apr 2022 13:34:09 +0000 (GMT) From: jenkins-admin@FreeBSD.org To: pkubaj@FreeBSD.org, peterj@FreeBSD.org, dev-ci@FreeBSD.org Cc: jenkins-admin@FreeBSD.org Subject: FreeBSD-main-amd64-test - Build #21037 - Still Unstable Message-ID: <1563625161.1621.1648906449948@jenkins.ci.freebsd.org> In-Reply-To: <192550868.1615.1648901704496@jenkins.ci.freebsd.org> References: <192550868.1615.1648901704496@jenkins.ci.freebsd.org>
next in thread | previous in thread | raw e-mail | index | archive | help
------=_Part_1620_382854800.1648906449500 Content-Type: text/plain; charset=UTF-8 Content-Transfer-Encoding: 7bit FreeBSD-main-amd64-test - Build #21037 (57b6ac48a96c99e684ab4dc85b8a87097797dc9f) - Still Unstable Build information: https://ci.FreeBSD.org/job/FreeBSD-main-amd64-test/21037/ Full change log: https://ci.FreeBSD.org/job/FreeBSD-main-amd64-test/21037/changes Full build log: https://ci.FreeBSD.org/job/FreeBSD-main-amd64-test/21037/console Status explanation: "Unstable" - some tests are suspected being broken by the following changes "Still Unstable" - the failing test cases have not been fixed by these following changes and this is a notification to note that these changes have not been fully tested by the CI system Change summaries: (Those commits are likely but not certainly responsible) 9a89977bf633d71760fa57a7542ef0f7fc0349e5 by peterj: kern: Fix typo in kassert message. 57b6ac48a96c99e684ab4dc85b8a87097797dc9f by pkubaj: powerpc: implement __clear_cache The failed test cases: 3 tests failed. FAILED: sys.netpfil.pf.ether.mac Error Message: Failed to set PF rules in alcatraz FAILED: sys.netpfil.pf.pass_block.v6 Error Message: Failed to set PF rules in alcatraz FAILED: sys.netpfil.pf.table.pr251414 Error Message: Failed to set PF rules in alcatraz ------=_Part_1620_382854800.1648906449500--
Want to link to this message? Use this URL: <https://mail-archive.FreeBSD.org/cgi/mid.cgi?1563625161.1621.1648906449948>