Skip site navigation (1)Skip section navigation (2)
Date:      Tue, 28 Jan 2025 19:53:08 +0000 (GMT)
From:      jenkins-admin@FreeBSD.org
To:        markj@FreeBSD.org, dev-ci@FreeBSD.org
Cc:        jenkins-admin@FreeBSD.org
Subject:   FreeBSD-main-amd64-test - Build #25974 - Still Unstable
Message-ID:  <1910678095.1761.1738093988979@jenkins.ci.freebsd.org>
In-Reply-To: <756725670.1747.1738086552058@jenkins.ci.freebsd.org>
References:  <756725670.1747.1738086552058@jenkins.ci.freebsd.org>

next in thread | previous in thread | raw e-mail | index | archive | help
------=_Part_1760_1919752633.1738093988657
Content-Type: text/plain; charset=UTF-8
Content-Transfer-Encoding: 7bit

FreeBSD-main-amd64-test - Build #25974 (5289625dfecb962e0410dfafc403aced3b9a2e4b) - Still Unstable

Build information: https://ci.FreeBSD.org/job/FreeBSD-main-amd64-test/25974/
Full change log: https://ci.FreeBSD.org/job/FreeBSD-main-amd64-test/25974/changes
Full build log: https://ci.FreeBSD.org/job/FreeBSD-main-amd64-test/25974/console

Status explanation:
"Unstable" - some tests are suspected being broken by the following changes
"Still Unstable" - the failing test cases have not been fixed by these
                   following changes and this is a notification to note that
                   these changes have not been fully tested by the CI system

Change summaries:
(Those commits are likely but not certainly responsible)

c43ae7ab4bf89c2b274c1cbefe663c456e9211d1 by markj:
etcupdate: Restrict access to the conflicts directory

5289625dfecb962e0410dfafc403aced3b9a2e4b by markj:
zinject: Fix format string errors on 32-bit platforms



The failed test cases:

4 tests failed.
FAILED:  lib.csu.dynamiclib.cxx_constructors.__test_cases_list__

Error Message:
Test program did not exit cleanly

FAILED:  lib.csu.dynamiclib.fini_test.__test_cases_list__

Error Message:
Test program did not exit cleanly

FAILED:  lib.csu.dynamiclib.init_test.__test_cases_list__

Error Message:
Test program did not exit cleanly

FAILED:  sys.net.routing.test_routing_l3.py.TestIfOps::test_change_prefix_route[inet]

Error Message:
/usr/tests/sys/net/routing/test_routing_l3.py:42: AssertionError
------=_Part_1760_1919752633.1738093988657--



Want to link to this message? Use this URL: <https://mail-archive.FreeBSD.org/cgi/mid.cgi?1910678095.1761.1738093988979>