Date: Thu, 17 Nov 2022 07:43:12 +0000 (GMT) From: jenkins-admin@FreeBSD.org To: delphij@FreeBSD.org, dev-ci@FreeBSD.org Cc: jenkins-admin@FreeBSD.org Subject: FreeBSD-main-amd64-test - Build #22499 - Unstable Message-ID: <1480059019.4137.1668670992679@jenkins.ci.freebsd.org>
next in thread | raw e-mail | index | archive | help
------=_Part_4136_733505775.1668670992185 Content-Type: text/plain; charset=UTF-8 Content-Transfer-Encoding: 7bit FreeBSD-main-amd64-test - Build #22499 (9e6bbe47a503137f1698232070cb4c1a4f14be10) - Unstable Build information: https://ci.FreeBSD.org/job/FreeBSD-main-amd64-test/22499/ Full change log: https://ci.FreeBSD.org/job/FreeBSD-main-amd64-test/22499/changes Full build log: https://ci.FreeBSD.org/job/FreeBSD-main-amd64-test/22499/console Status explanation: "Unstable" - some tests are suspected being broken by the following changes "Still Unstable" - the failing test cases have not been fixed by these following changes and this is a notification to note that these changes have not been fully tested by the CI system Change summaries: (Those commits are likely but not certainly responsible) bbf0e6b90032784aebc8e88024d495a250b0dad5 by delphij: Vendor import of xz-5.2.8 (trimmed). The failed test cases: 3 tests failed. FAILED: sys.fs.fusefs.mknod.main Error Message: Returned non-success exit status 1 FAILED: sys.kern.ktls_test.ktls_receive_aes128_gcm_1_2_bad_major Error Message: /usr/src/tests/sys/kern/ktls_test.c:258: close(sv[1]) == 0 not met FAILED: sys.netinet6.test_ip6_output.py.TestIP6OutputScope::test_output6_linklocal_scope[gu_to_ll] Error Message: /usr/local/lib/python3.9/multiprocessing/connection.py:388: EOFError ------=_Part_4136_733505775.1668670992185--
Want to link to this message? Use this URL: <https://mail-archive.FreeBSD.org/cgi/mid.cgi?1480059019.4137.1668670992679>