Date: Thu, 19 Jun 2025 12:08:32 +0000 (GMT) From: jenkins-admin@FreeBSD.org To: andrew@FreeBSD.org, dev-ci@FreeBSD.org Cc: jenkins-admin@FreeBSD.org Subject: FreeBSD-main-amd64-test - Build #26599 - Still Unstable Message-ID: <2132885500.521.1750334912952@jenkins.ci.freebsd.org> In-Reply-To: <23740517.519.1750327803491@jenkins.ci.freebsd.org> References: <23740517.519.1750327803491@jenkins.ci.freebsd.org>
next in thread | previous in thread | raw e-mail | index | archive | help
FreeBSD-main-amd64-test - Build #26599 (ea8dc498aa8ea91ce0364a3f0ccdb740a24dcfb4) - Still Unstable Build information: https://ci.FreeBSD.org/job/FreeBSD-main-amd64-test/26599/ Full change log: https://ci.FreeBSD.org/job/FreeBSD-main-amd64-test/26599/changes Full build log: https://ci.FreeBSD.org/job/FreeBSD-main-amd64-test/26599/console Status explanation: "Unstable" - some tests are suspected being broken by the following changes "Still Unstable" - the failing test cases have not been fixed by these following changes and this is a notification to note that these changes have not been fully tested by the CI system Change summaries: (Those commits are likely but not certainly responsible) ea8dc498aa8ea91ce0364a3f0ccdb740a24dcfb4 by andrew: arm64: Create an L3 table to limit permissions The failed test cases: 13 tests failed. FAILED: lib.libcasper.services.cap_fileargs.fileargs_test.fileargs__fopen_write Error Message: /usr/src/lib/libcasper/services/cap_fileargs/tests/fileargs_test.c:528: test_file_fopen(fa, files[i], "w", &pfile) == 0 not met FAILED: lib.libcasper.services.cap_fileargs.fileargs_test.fileargs__open_realpath Error Message: /usr/src/lib/libcasper/services/cap_fileargs/tests/fileargs_test.c:733: test_file_open(fa, files[i], &fd) == 0 not met FAILED: sys.fs.fusefs.bad_server.main Error Message: Returned non-success exit status 1 FAILED: libexec.nuageinit.nuageinit.config2_userdata_packages Error Message: atf-check failed; see the output of the test for details FAILED: bin.pwait.pwait_test.basic Error Message: atf-check failed; see the output of the test for details FAILED: bin.pwait.pwait_test.or_flag Error Message: atf-check failed; see the output of the test for details FAILED: sys.netpfil.pf.sctp.related_icmp Error Message: atf-check failed; see the output of the test for details FAILED: lib.libc.gen.glob2_test.glob_callback_test Error Message: /usr/src/lib/libc/tests/gen/glob2_test.c:152: glob(3) failed to invoke callback function FAILED: lib.libc.gen.glob_blocks_test.glob_b_callback_test Error Message: /usr/src/lib/libc/tests/gen/glob_blocks_test.c:35: glob(3) failed to invoke callback block FAILED: sys.netgraph.ksocket.udp_bind Error Message: /usr/src/tests/sys/netgraph/ksocket.c:104: connect(us, (struct sockaddr *)rep->data, sizeof(struct sockaddr_in)) == 0 not met FAILED: sys.netgraph.ksocket.udp_connect Error Message: /usr/src/tests/sys/netgraph/ksocket.c:72: NgSendMsg(cs, ".:" OURHOOK, NGM_KSOCKET_COOKIE, NGM_KSOCKET_CONNECT, &sa, sizeof(sa)) >= 0 not met FAILED: sys.netinet.broadcast.INADDR_BROADCAST Error Message: /usr/src/tests/sys/netinet/broadcast.c:65: sending of broadcast failed: 51 FAILED: sys.netinet.fibs_test.same_ip_multiple_ifaces_fib0 Error Message: atf-check failed; see the output of the test for details
Want to link to this message? Use this URL: <https://mail-archive.FreeBSD.org/cgi/mid.cgi?2132885500.521.1750334912952>
