Date: Tue, 7 Oct 2025 04:27:45 +0000 (GMT) From: jenkins-admin@FreeBSD.org To: jlduran@FreeBSD.org, markj@FreeBSD.org, dev-ci@FreeBSD.org Cc: jenkins-admin@FreeBSD.org Subject: FreeBSD-stable-15-amd64-test - Build #26 - Still Unstable Message-ID: <2185998.367.1759811265554@jenkins.ci.freebsd.org> In-Reply-To: <371807733.281.1759778007436@jenkins.ci.freebsd.org> References: <371807733.281.1759778007436@jenkins.ci.freebsd.org>
next in thread | previous in thread | raw e-mail | index | archive | help
FreeBSD-stable-15-amd64-test - Build #26 (f459a2ef73b78b153b8f85383b5a144948196994) - Still Unstable Build information: https://ci.FreeBSD.org/job/FreeBSD-stable-15-amd64-test/26/ Full change log: https://ci.FreeBSD.org/job/FreeBSD-stable-15-amd64-test/26/changes Full build log: https://ci.FreeBSD.org/job/FreeBSD-stable-15-amd64-test/26/console Status explanation: "Unstable" - some tests are suspected being broken by the following changes "Still Unstable" - the failing test cases have not been fixed by these following changes and this is a notification to note that these changes have not been fully tested by the CI system Change summaries: (Those commits are likely but not certainly responsible) 8435c4112ae41d66d9cc9ce2124a44431c0e9164 by jlduran: nss_tacplus: Fix typo MK_INSTALLIB -> MK_INSTALLLIB 9bb0282097efcf7d4b642025e3cf2cc110f2fa87 by markj: release: Complete NO_ROOTification of Vagrant builds f459a2ef73b78b153b8f85383b5a144948196994 by markj: release: Set INSTALL_AS_USER=yes when running pkg clean in NO_ROOT mode The failed test cases: 10 tests failed. FAILED: sbin.ipfw.test_add_rule.py.TestAddRule::test_add_action[call_420] Error Message: /usr/tests/atf_python/sys/netpfil/ipfw/insns.py:105: ValueError FAILED: sbin.ipfw.test_add_rule.py.TestAddRule::test_add_action[return] Error Message: /usr/tests/atf_python/sys/netpfil/ipfw/insns.py:105: ValueError FAILED: sbin.ipfw.test_add_rule.py.TestAddRule::test_add_action[skipto_42] Error Message: /usr/tests/atf_python/sys/netpfil/ipfw/insns.py:105: ValueError FAILED: sbin.ipfw.test_add_rule.py.TestAddRule::test_add_rule[test_check_state] Error Message: /usr/tests/atf_python/sys/netpfil/ipfw/insns.py:105: ValueError FAILED: sbin.ipfw.test_add_rule.py.TestAddRule::test_add_rule[test_eaction_ntp] Error Message: /usr/tests/sbin/ipfw/test_add_rule.py:119: AssertionError FAILED: sbin.ipfw.test_add_rule.py.TestAddRule::test_add_rule[test_eaction_tcp-setmss] Error Message: /usr/tests/sbin/ipfw/test_add_rule.py:119: AssertionError FAILED: sbin.ipfw.test_add_rule.py.TestAddRule::test_add_rule[test_keep_state] Error Message: /usr/tests/atf_python/sys/netpfil/ipfw/insns.py:105: ValueError FAILED: sbin.ipfw.test_add_rule.py.TestAddRule::test_add_rule[test_record_state] Error Message: /usr/tests/atf_python/sys/netpfil/ipfw/insns.py:105: ValueError FAILED: sbin.ipfw.test_add_rule.py.TestAddRule::test_add_rule[test_tables] Error Message: /usr/tests/sbin/ipfw/test_add_rule.py:119: AssertionError FAILED: sys.netlink.test_netlink_message_writer.py.__test_cases_list__ Error Message: Test program did not exit cleanly
Want to link to this message? Use this URL: <https://mail-archive.FreeBSD.org/cgi/mid.cgi?2185998.367.1759811265554>
