Skip site navigation (1)Skip section navigation (2)
Date:      Wed, 21 Feb 2024 20:55:53 +0000 (GMT)
From:      jenkins-admin@FreeBSD.org
To:        gbe@FreeBSD.org, andrew@FreeBSD.org, dev-ci@FreeBSD.org
Cc:        jenkins-admin@FreeBSD.org
Subject:   FreeBSD-main-amd64-gcc13_build - Build #322 - Still Failing
Message-ID:  <783445723.1685.1708548955959@jenkins.ci.freebsd.org>
In-Reply-To: <1689511207.1649.1708521294808@jenkins.ci.freebsd.org>
References:  <1689511207.1649.1708521294808@jenkins.ci.freebsd.org>

next in thread | previous in thread | raw e-mail | index | archive | help
------=_Part_1684_1776997397.1708548953602
Content-Type: text/plain; charset=UTF-8
Content-Transfer-Encoding: quoted-printable

FreeBSD-main-amd64-gcc13_build - Build #322 (58df49801d9d58e61cc2adc8fd1e68=
48b64d2453) - Still Failing

Build information: https://ci.FreeBSD.org/job/FreeBSD-main-amd64-gcc13_buil=
d/322/
Full change log: https://ci.FreeBSD.org/job/FreeBSD-main-amd64-gcc13_build/=
322/changes
Full build log: https://ci.FreeBSD.org/job/FreeBSD-main-amd64-gcc13_build/3=
22/console

Status explanation:
"Failure" - the build is suspected being broken by the following changes
"Still Failing" - the build has not been fixed by the following changes and
                  this is a notification to note that these changes have
                  not been fully tested by the CI system

Change summaries:
(Those commits are likely but not certainly responsible)

ffea732c5192070a6877409428b0a2cc1728aa16 by gbe:
ls.1: Mention CLICOLOR environment variable

5e7941b6c979a55dc67baf316db6932c09b14022 by andrew:
arm64: Add CurrentEL register definitions

37563d39efd115c7e6ccddb5f2dc1e0d089b2b8b by andrew:
arm64: Use the new CurrentEL macros

353b6a5bcb5ae6943903b38ebcc0922b059ff8b8 by andrew:
arm64: Add in_vhe() to find if the kernel is in VHE

58df49801d9d58e61cc2adc8fd1e6848b64d2453 by andrew:
arm64: Fix the has_hyp check



The end of the build log:

[...truncated 104.23 MiB...]
   26 | class _LIBCPP_TEMPLATE_VIS _LIBCPP_DEPRECATED_IN_CXX11 mem_fun_t
      |                                                        ^~~~~~~~~
/tmp/obj/workspace/src/amd64.amd64/tmp/usr/include/c++/v1/__functional/mem_=
fun_ref.h: In function 'std::__1::mem_fun_t<_Sp, _Tp> std::__1::mem_fun(_Sp=
 (_Tp::*)())':
/tmp/obj/workspace/src/amd64.amd64/tmp/usr/include/c++/v1/__functional/mem_=
fun_ref.h:53:13: warning: 'template<class _Sp, class _Tp> class std::__1::m=
em_fun_t' is deprecated [-Wdeprecated-declarations]
   53 |     {return mem_fun_t<_Sp,_Tp>(__f);}
      |             ^~~~~~~~~
/tmp/obj/workspace/src/amd64.amd64/tmp/usr/include/c++/v1/__functional/mem_=
fun_ref.h:26:56: note: declared here
   26 | class _LIBCPP_TEMPLATE_VIS _LIBCPP_DEPRECATED_IN_CXX11 mem_fun_t
      |                                                        ^~~~~~~~~
/tmp/obj/workspace/src/amd64.amd64/tmp/usr/include/c++/v1/__functional/mem_=
fun_ref.h: At global scope:
/tmp/obj/workspace/src/amd64.amd64/tmp/usr/include/c++/v1/__functional/mem_=
fun_ref.h:57:1: warning: 'template<class _Sp, class _Tp, class _Ap> class s=
td::__1::mem_fun1_t' is deprecated [-Wdeprecated-declarations]
   57 | mem_fun1_t<_Sp,_Tp,_Ap>
      | ^~~~~~~~~~
/tmp/obj/workspace/src/amd64.amd64/tmp/usr/include/c++/v1/__functional/mem_=
fun_ref.h:38:56: note: declared here
   38 | class _LIBCPP_TEMPLATE_VIS _LIBCPP_DEPRECATED_IN_CXX11 mem_fun1_t
      |                                                        ^~~~~~~~~~
/tmp/obj/workspace/src/amd64.amd64/tmp/usr/include/c++/v1/__functional/mem_=
fun_ref.h: In function 'std::__1::mem_fun1_t<_Sp, _Tp, _Ap> std::__1::mem_f=
un(_Sp (_Tp::*)(_Ap))':
/tmp/obj/workspace/src/amd64.amd64/tmp/usr/include/c++/v1/__functional/mem_=
fun_ref.h:59:13: warning: 'template<class _Sp, class _Tp, class _Ap> class =
std::__1::mem_fun1_t' is deprecated [-Wdeprecated-declarations]
   59 |     {return mem_fun1_t<_Sp,_Tp,_Ap>(__f);}
      |             ^~~~~~~~~~
/tmp/obj/workspace/src/amd64.amd64/tmp/usr/include/c++/v1/__functional/mem_=
fun_ref.h:38:56: note: declared here
   38 | class _LIBCPP_TEMPLATE_VIS _LIBCPP_DEPRECATED_IN_CXX11 mem_fun1_t
      |                                                        ^~~~~~~~~~
/tmp/obj/workspace/src/amd64.amd64/tmp/usr/include/c++/v1/__functional/mem_=
fun_ref.h: At global scope:
/tmp/obj/workspace/src/amd64.amd64/tmp/usr/include/c++/v1/__functional/mem_=
fun_ref.h:87:1: warning: 'template<class _Sp, class _Tp> class std::__1::me=
m_fun_ref_t' is deprecated [-Wdeprecated-declarations]
   87 | mem_fun_ref_t<_Sp,_Tp>
      | ^~~~~~~~~~~~~
/tmp/obj/workspace/src/amd64.amd64/tmp/usr/include/c++/v1/__functional/mem_=
fun_ref.h:62:56: note: declared here
   62 | class _LIBCPP_TEMPLATE_VIS _LIBCPP_DEPRECATED_IN_CXX11 mem_fun_ref_=
t
      |                                                        ^~~~~~~~~~~~=
~
/tmp/obj/workspace/src/amd64.amd64/tmp/usr/include/c++/v1/__functional/mem_=
fun_ref.h: In function 'std::__1::mem_fun_ref_t<_Sp, _Tp> std::__1::mem_fun=
_ref(_Sp (_Tp::*)())':
/tmp/obj/workspace/src/amd64.amd64/tmp/usr/include/c++/v1/__functional/mem_=
fun_ref.h:89:13: warning: 'template<class _Sp, class _Tp> class std::__1::m=
em_fun_ref_t' is deprecated [-Wdeprecated-declarations]
   89 |     {return mem_fun_ref_t<_Sp,_Tp>(__f);}
      |             ^~~~~~~~~~~~~
/tmp/obj/workspace/src/amd64.amd64/tmp/usr/include/c++/v1/__functional/mem_=
fun_ref.h:62:56: note: declared here
   62 | class _LIBCPP_TEMPLATE_VIS _LIBCPP_DEPRECATED_IN_CXX11 mem_fun_ref_=
t
      |                                                        ^~~~~~~~~~~~=
~
/tmp/obj/workspace/src/amd64.amd64/tmp/usr/include/c++/v1/__functional/mem_=
fun_ref.h: At global scope:
/tmp/obj/workspace/src/amd64.amd64/tmp/usr/include/c++/v1/__functional/mem_=
fun_ref.h:93:1: warning: 'template<class _Sp, class _Tp, class _Ap> class s=
td::__1::mem_fun1_ref_t' is deprecated [-Wdeprecated-declarations]
   93 | mem_fun1_ref_t<_Sp,_Tp,_Ap>
      | ^~~~~~~~~~~~~~
/tmp/obj/workspace/src/amd64.amd64/tmp/usr/include/c++/v1/__functional/mem_=
fun_ref.h:74:56: note: declared here
   74 | class _LIBCPP_TEMPLATE_VIS _LIBCPP_DEPRECATED_IN_CXX11 mem_fun1_ref=
_t
      |                                                        ^~~~~~~~~~~~=
~~
/tmp/obj/workspace/src/amd64.amd64/tmp/usr/include/c++/v1/__functional/mem_=
fun_ref.h: In function 'std::__1::mem_fun1_ref_t<_Sp, _Tp, _Ap> std::__1::m=
em_fun_ref(_Sp (_Tp::*)(_Ap))':
/tmp/obj/workspace/src/amd64.amd64/tmp/usr/include/c++/v1/__functional/mem_=
fun_ref.h:95:13: warning: 'template<class _Sp, class _Tp, class _Ap> class =
std::__1::mem_fun1_ref_t' is deprecated [-Wdeprecated-declarations]
   95 |     {return mem_fun1_ref_t<_Sp,_Tp,_Ap>(__f);}
      |             ^~~~~~~~~~~~~~
/tmp/obj/workspace/src/amd64.amd64/tmp/usr/include/c++/v1/__functional/mem_=
fun_ref.h:74:56: note: declared here
   74 | class _LIBCPP_TEMPLATE_VIS _LIBCPP_DEPRECATED_IN_CXX11 mem_fun1_ref=
_t
      |                                                        ^~~~~~~~~~~~=
~~
/tmp/obj/workspace/src/amd64.amd64/tmp/usr/include/c++/v1/__functional/mem_=
fun_ref.h: At global scope:
/tmp/obj/workspace/src/amd64.amd64/tmp/usr/include/c++/v1/__functional/mem_=
fun_ref.h:123:1: warning: 'template<class _Sp, class _Tp> class std::__1::c=
onst_mem_fun_t' is deprecated [-Wdeprecated-declarations]
  123 | const_mem_fun_t<_Sp,_Tp>
      | ^~~~~~~~~~~~~~~
/tmp/obj/workspace/src/amd64.amd64/tmp/usr/include/c++/v1/__functional/mem_=
fun_ref.h:98:56: note: declared here
   98 | class _LIBCPP_TEMPLATE_VIS _LIBCPP_DEPRECATED_IN_CXX11 const_mem_fu=
n_t
      |                                                        ^~~~~~~~~~~~=
~~~
/tmp/obj/workspace/src/amd64.amd64/tmp/usr/include/c++/v1/__functional/mem_=
fun_ref.h: In function 'std::__1::const_mem_fun_t<_Sp, _Tp> std::__1::mem_f=
un(_Sp (_Tp::*)() const)':
/tmp/obj/workspace/src/amd64.amd64/tmp/usr/include/c++/v1/__functional/mem_=
fun_ref.h:125:13: warning: 'template<class _Sp, class _Tp> class std::__1::=
const_mem_fun_t' is deprecated [-Wdeprecated-declarations]
  125 |     {return const_mem_fun_t<_Sp,_Tp>(__f);}
      |             ^~~~~~~~~~~~~~~
/tmp/obj/workspace/src/amd64.amd64/tmp/usr/include/c++/v1/__functional/mem_=
fun_ref.h:98:56: note: declared here
   98 | class _LIBCPP_TEMPLATE_VIS _LIBCPP_DEPRECATED_IN_CXX11 const_mem_fu=
n_t
      |                                                        ^~~~~~~~~~~~=
~~~
/tmp/obj/workspace/src/amd64.amd64/tmp/usr/include/c++/v1/__functional/mem_=
fun_ref.h: At global scope:
/tmp/obj/workspace/src/amd64.amd64/tmp/usr/include/c++/v1/__functional/mem_=
fun_ref.h:129:1: warning: 'template<class _Sp, class _Tp, class _Ap> class =
std::__1::const_mem_fun1_t' is deprecated [-Wdeprecated-declarations]
  129 | const_mem_fun1_t<_Sp,_Tp,_Ap>
      | ^~~~~~~~~~~~~~~~
/tmp/obj/workspace/src/amd64.amd64/tmp/usr/include/c++/v1/__functional/mem_=
fun_ref.h:110:56: note: declared here
  110 | class _LIBCPP_TEMPLATE_VIS _LIBCPP_DEPRECATED_IN_CXX11 const_mem_fu=
n1_t
      |                                                        ^~~~~~~~~~~~=
~~~~
/tmp/obj/workspace/src/amd64.amd64/tmp/usr/include/c++/v1/__functional/mem_=
fun_ref.h: In function 'std::__1::const_mem_fun1_t<_Sp, _Tp, _Ap> std::__1:=
:mem_fun(_Sp (_Tp::*)(_Ap) const)':
/tmp/obj/workspace/src/amd64.amd64/tmp/usr/include/c++/v1/__functional/mem_=
fun_ref.h:131:13: warning: 'template<class _Sp, class _Tp, class _Ap> class=
 std::__1::const_mem_fun1_t' is deprecated [-Wdeprecated-declarations]
  131 |     {return const_mem_fun1_t<_Sp,_Tp,_Ap>(__f);}
      |             ^~~~~~~~~~~~~~~~
/tmp/obj/workspace/src/amd64.amd64/tmp/usr/include/c++/v1/__functional/mem_=
fun_ref.h:110:56: note: declared here
  110 | class _LIBCPP_TEMPLATE_VIS _LIBCPP_DEPRECATED_IN_CXX11 const_mem_fu=
n1_t
      |                                                        ^~~~~~~~~~~~=
~~~~
/tmp/obj/workspace/src/amd64.amd64/tmp/usr/include/c++/v1/__functional/mem_=
fun_ref.h: At global scope:
/tmp/obj/workspace/src/amd64.amd64/tmp/usr/include/c++/v1/__functional/mem_=
fun_ref.h:159:1: warning: 'template<class _Sp, class _Tp> class std::__1::c=
onst_mem_fun_ref_t' is deprecated [-Wdeprecated-declarations]
  159 | const_mem_fun_ref_t<_Sp,_Tp>
      | ^~~~~~~~~~~~~~~~~~~
/tmp/obj/workspace/src/amd64.amd64/tmp/usr/include/c++/v1/__functional/mem_=
fun_ref.h:134:56: note: declared here
  134 | class _LIBCPP_TEMPLATE_VIS _LIBCPP_DEPRECATED_IN_CXX11 const_mem_fu=
n_ref_t
      |                                                        ^~~~~~~~~~~~=
~~~~~~~
/tmp/obj/workspace/src/amd64.amd64/tmp/usr/include/c++/v1/__functional/mem_=
fun_ref.h: In function 'std::__1::const_mem_fun_ref_t<_Sp, _Tp> std::__1::m=
em_fun_ref(_Sp (_Tp::*)() const)':
/tmp/obj/workspace/src/amd64.amd64/tmp/usr/include/c++/v1/__functional/mem_=
fun_ref.h:161:13: warning: 'template<class _Sp, class _Tp> class std::__1::=
const_mem_fun_ref_t' is deprecated [-Wdeprecated-declarations]
  161 |     {return const_mem_fun_ref_t<_Sp,_Tp>(__f);}
      |             ^~~~~~~~~~~~~~~~~~~
/tmp/obj/workspace/src/amd64.amd64/tmp/usr/include/c++/v1/__functional/mem_=
fun_ref.h:134:56: note: declared here
  134 | class _LIBCPP_TEMPLATE_VIS _LIBCPP_DEPRECATED_IN_CXX11 const_mem_fu=
n_ref_t
      |                                                        ^~~~~~~~~~~~=
~~~~~~~
/tmp/obj/workspace/src/amd64.amd64/tmp/usr/include/c++/v1/__functional/mem_=
fun_ref.h: At global scope:
/tmp/obj/workspace/src/amd64.amd64/tmp/usr/include/c++/v1/__functional/mem_=
fun_ref.h:165:1: warning: 'template<class _Sp, class _Tp, class _Ap> class =
std::__1::const_mem_fun1_ref_t' is deprecated [-Wdeprecated-declarations]
  165 | const_mem_fun1_ref_t<_Sp,_Tp,_Ap>
      | ^~~~~~~~~~~~~~~~~~~~
/tmp/obj/workspace/src/amd64.amd64/tmp/usr/include/c++/v1/__functional/mem_=
fun_ref.h:146:56: note: declared here
  146 | class _LIBCPP_TEMPLATE_VIS _LIBCPP_DEPRECATED_IN_CXX11 const_mem_fu=
n1_ref_t
      |                                                        ^~~~~~~~~~~~=
~~~~~~~~
/tmp/obj/workspace/src/amd64.amd64/tmp/usr/include/c++/v1/__functional/mem_=
fun_ref.h: In function 'std::__1::const_mem_fun1_ref_t<_Sp, _Tp, _Ap> std::=
__1::mem_fun_ref(_Sp (_Tp::*)(_Ap) const)':
/tmp/obj/workspace/src/amd64.amd64/tmp/usr/include/c++/v1/__functional/mem_=
fun_ref.h:167:13: warning: 'template<class _Sp, class _Tp, class _Ap> class=
 std::__1::const_mem_fun1_ref_t' is deprecated [-Wdeprecated-declarations]
  167 |     {return const_mem_fun1_ref_t<_Sp,_Tp,_Ap>(__f);}
      |             ^~~~~~~~~~~~~~~~~~~~
/tmp/obj/workspace/src/amd64.amd64/tmp/usr/include/c++/v1/__functional/mem_=
fun_ref.h:146:56: note: declared here
  146 | class _LIBCPP_TEMPLATE_VIS _LIBCPP_DEPRECATED_IN_CXX11 const_mem_fu=
n1_ref_t
      |                                                        ^~~~~~~~~~~~=
~~~~~~~~
In file included from /tmp/obj/workspace/src/amd64.amd64/tmp/usr/include/c+=
+/v1/functional:537:
/tmp/obj/workspace/src/amd64.amd64/tmp/usr/include/c++/v1/__functional/poin=
ter_to_binary_function.h: At global scope:
/tmp/obj/workspace/src/amd64.amd64/tmp/usr/include/c++/v1/__functional/poin=
ter_to_binary_function.h:38:1: warning: 'template<class _Arg1, class _Arg2,=
 class _Result> class std::__1::pointer_to_binary_function' is deprecated [=
-Wdeprecated-declarations]
   38 | pointer_to_binary_function<_Arg1,_Arg2,_Result>
      | ^~~~~~~~~~~~~~~~~~~~~~~~~~
/tmp/obj/workspace/src/amd64.amd64/tmp/usr/include/c++/v1/__functional/poin=
ter_to_binary_function.h:25:56: note: declared here
   25 | class _LIBCPP_TEMPLATE_VIS _LIBCPP_DEPRECATED_IN_CXX11 pointer_to_b=
inary_function
      |                                                        ^~~~~~~~~~~~=
~~~~~~~~~~~~~~
/tmp/obj/workspace/src/amd64.amd64/tmp/usr/include/c++/v1/__functional/poin=
ter_to_binary_function.h: In function 'std::__1::pointer_to_binary_function=
<_Arg1, _Arg2, _Result> std::__1::ptr_fun(_Result (*)(_Arg1, _Arg2))':
/tmp/obj/workspace/src/amd64.amd64/tmp/usr/include/c++/v1/__functional/poin=
ter_to_binary_function.h:40:13: warning: 'template<class _Arg1, class _Arg2=
, class _Result> class std::__1::pointer_to_binary_function' is deprecated =
[-Wdeprecated-declarations]
   40 |     {return pointer_to_binary_function<_Arg1,_Arg2,_Result>(__f);}
      |             ^~~~~~~~~~~~~~~~~~~~~~~~~~
/tmp/obj/workspace/src/amd64.amd64/tmp/usr/include/c++/v1/__functional/poin=
ter_to_binary_function.h:25:56: note: declared here
   25 | class _LIBCPP_TEMPLATE_VIS _LIBCPP_DEPRECATED_IN_CXX11 pointer_to_b=
inary_function
      |                                                        ^~~~~~~~~~~~=
~~~~~~~~~~~~~~
In file included from /tmp/obj/workspace/src/amd64.amd64/tmp/usr/include/c+=
+/v1/functional:538:
/tmp/obj/workspace/src/amd64.amd64/tmp/usr/include/c++/v1/__functional/poin=
ter_to_unary_function.h: At global scope:
/tmp/obj/workspace/src/amd64.amd64/tmp/usr/include/c++/v1/__functional/poin=
ter_to_unary_function.h:38:1: warning: 'template<class _Arg, class _Result>=
 class std::__1::pointer_to_unary_function' is deprecated [-Wdeprecated-dec=
larations]
   38 | pointer_to_unary_function<_Arg,_Result>
      | ^~~~~~~~~~~~~~~~~~~~~~~~~
/tmp/obj/workspace/src/amd64.amd64/tmp/usr/include/c++/v1/__functional/poin=
ter_to_unary_function.h:25:56: note: declared here
   25 | class _LIBCPP_TEMPLATE_VIS _LIBCPP_DEPRECATED_IN_CXX11 pointer_to_u=
nary_function
      |                                                        ^~~~~~~~~~~~=
~~~~~~~~~~~~~
/tmp/obj/workspace/src/amd64.amd64/tmp/usr/include/c++/v1/__functional/poin=
ter_to_unary_function.h: In function 'std::__1::pointer_to_unary_function<_=
Arg, _Result> std::__1::ptr_fun(_Result (*)(_Arg))':
/tmp/obj/workspace/src/amd64.amd64/tmp/usr/include/c++/v1/__functional/poin=
ter_to_unary_function.h:40:13: warning: 'template<class _Arg, class _Result=
> class std::__1::pointer_to_unary_function' is deprecated [-Wdeprecated-de=
clarations]
   40 |     {return pointer_to_unary_function<_Arg,_Result>(__f);}
      |             ^~~~~~~~~~~~~~~~~~~~~~~~~
/tmp/obj/workspace/src/amd64.amd64/tmp/usr/include/c++/v1/__functional/poin=
ter_to_unary_function.h:25:56: note: declared here
   25 | class _LIBCPP_TEMPLATE_VIS _LIBCPP_DEPRECATED_IN_CXX11 pointer_to_u=
nary_function
      |                                                        ^~~~~~~~~~~~=
~~~~~~~~~~~~~
--- all_subdir_usr.bin ---
--- all_subdir_usr.bin/sort/tests ---
=3D=3D=3D> usr.bin/sort/tests (all)
--- sort_monthsort_test ---
echo '#! /usr/libexec/atf-sh' > sort_monthsort_test.tmp
cat /workspace/src/usr.bin/sort/tests/sort_monthsort_test.sh >>sort_monthso=
rt_test.tmp
chmod +x sort_monthsort_test.tmp
mv sort_monthsort_test.tmp sort_monthsort_test
--- sort_test ---
echo '#! /usr/libexec/atf-sh' > sort_test.tmp
cat /workspace/src/contrib/netbsd-tests/usr.bin/sort/t_sort.sh >>sort_test.=
tmp
chmod +x sort_test.tmp
mv sort_test.tmp sort_test
--- Kyuafile ---
--- sort.full ---
/usr/local/bin/x86_64-unknown-freebsd14.0-gcc13 --sysroot=3D/tmp/obj/worksp=
ace/src/amd64.amd64/tmp -B/usr/local/x86_64-unknown-freebsd14.0/bin/ -O2 -p=
ipe -fno-common -fPIE -g -std=3Dc11 -Wno-format-zero-length -fstack-protect=
or-strong -Wsystem-headers -Werror -Wall -Wno-format-y2k -W -Wno-unused-par=
ameter -Wmissing-prototypes -Wpointer-arith -Wreturn-type -Wcast-qual -Wwri=
te-strings -Wswitch -Wshadow -Wunused-parameter -Wcast-align -Wchar-subscri=
pts -Wnested-externs -Wold-style-definition -Wno-pointer-sign -Wdate-time -=
Wno-error=3Daddress -Wno-error=3Darray-bounds -Wno-error=3Dattributes -Wno-=
error=3Dbool-compare -Wno-error=3Dcast-align -Wno-error=3Dclobbered -Wno-er=
ror=3Ddeprecated-declarations -Wno-error=3Denum-compare -Wno-error=3Dextra =
-Wno-error=3Dlogical-not-parentheses -Wno-error=3Dstrict-aliasing -Wno-erro=
r=3Duninitialized -Wno-error=3Dunused-function -Wno-error=3Dunused-value -W=
no-error=3Dempty-body -Wno-error=3Dmaybe-uninitialized -Wno-error=3Dnonnull=
-compare -Wno-error=3Dshift-negative-value -Wno-error=3Dtautological-compar=
e -Wno-error=3Dunused-const-variable -Wno-error=3Dbool-operation -Wno-error=
=3Ddeprecated -Wno-error=3Dexpansion-to-defined -Wno-error=3Dformat-overflo=
w -Wno-error=3Dformat-truncation -Wno-error=3Dimplicit-fallthrough -Wno-err=
or=3Dint-in-bool-context -Wno-error=3Dmemset-elt-size -Wno-error=3Dnoexcept=
-type -Wno-error=3Dnonnull -Wno-error=3Dpointer-compare -Wno-error=3Dstring=
op-overflow -Wno-error=3Daggressive-loop-optimizations -Wno-error=3Dcast-fu=
nction-type -Wno-error=3Dcatch-value -Wno-error=3Dmultistatement-macros -Wn=
o-error=3Drestrict -Wno-error=3Dsizeof-pointer-memaccess -Wno-error=3Dstrin=
gop-truncation -Wno-return-type  -Wl,-zrelro -pie -Wl,-znoexecstack   -o so=
rt.full bwstring.o coll.o file.o mem.o radixsort.o sort.o vsort.o   -lmd=20
--- all_subdir_usr.sbin ---
--- all_subdir_usr.sbin/bluetooth ---
--- session.o ---
/usr/local/bin/x86_64-unknown-freebsd14.0-gcc13 --sysroot=3D/tmp/obj/worksp=
ace/src/amd64.amd64/tmp -B/usr/local/x86_64-unknown-freebsd14.0/bin/  -O2 -=
pipe -fno-common -I/workspace/src/usr.sbin/bluetooth/bthidd   -fPIE -g -MD =
 -MF.depend.session.o -MTsession.o -std=3Dgnu99 -Wno-format-zero-length -fs=
tack-protector-strong -Wsystem-headers -Werror -Wall -Wno-format-y2k -W -Wn=
o-unused-parameter -Wmissing-prototypes -Wpointer-arith -Wreturn-type -Wcas=
t-qual -Wwrite-strings -Wswitch -Wshadow -Wunused-parameter -Wcast-align -W=
char-subscripts -Wnested-externs -Wold-style-definition -Wno-pointer-sign -=
Wdate-time -Wno-error=3Daddress -Wno-error=3Darray-bounds -Wno-error=3Dattr=
ibutes -Wno-error=3Dbool-compare -Wno-error=3Dcast-align -Wno-error=3Dclobb=
ered -Wno-error=3Ddeprecated-declarations -Wno-error=3Denum-compare -Wno-er=
ror=3Dextra -Wno-error=3Dlogical-not-parentheses -Wno-error=3Dstrict-aliasi=
ng -Wno-error=3Duninitialized -Wno-error=3Dunused-function -Wno-error=3Dunu=
sed-value -Wno-error=3Dempty-body -Wno-error=3Dmaybe-uninitialized -Wno-err=
or=3Dnonnull-compare -Wno-error=3Dshift-negative-value -Wno-error=3Dtautolo=
gical-compare -Wno-error=3Dunused-const-variable -Wno-error=3Dbool-operatio=
n -Wno-error=3Ddeprecated -Wno-error=3Dexpansion-to-defined -Wno-error=3Dfo=
rmat-overflow -Wno-error=3Dformat-truncation -Wno-error=3Dimplicit-fallthro=
ugh -Wno-error=3Dint-in-bool-context -Wno-error=3Dmemset-elt-size -Wno-erro=
r=3Dnoexcept-type -Wno-error=3Dnonnull -Wno-error=3Dpointer-compare -Wno-er=
ror=3Dstringop-overflow -Wno-error=3Daggressive-loop-optimizations -Wno-err=
or=3Dcast-function-type -Wno-error=3Dcatch-value -Wno-error=3Dmultistatemen=
t-macros -Wno-error=3Drestrict -Wno-error=3Dsizeof-pointer-memaccess -Wno-e=
rror=3Dstringop-truncation -Wno-return-type        -c /workspace/src/usr.sb=
in/bluetooth/bthidd/session.c -o session.o
--- all_subdir_usr.bin ---
--- sort.1 ---
sed -e 's|%%THREADS%%|\.\\"|g' /workspace/src/usr.bin/sort/sort.1.in >sort.=
1
--- sort.debug ---
/usr/local/x86_64-unknown-freebsd14.0/bin/objcopy --only-keep-debug sort.fu=
ll sort.debug
--- sort.1.gz ---
gzip -cn sort.1 > sort.1.gz
--- sort ---
/usr/local/x86_64-unknown-freebsd14.0/bin/objcopy --strip-debug --add-gnu-d=
ebuglink=3Dsort.debug  sort.full sort
--- all_subdir_usr.bin/split ---
=3D=3D=3D> usr.bin/split (all)
--- .depend ---
echo split.full: /tmp/obj/workspace/src/amd64.amd64/tmp/usr/lib/libc.a /tmp=
/obj/workspace/src/amd64.amd64/tmp/usr/lib/libutil.a >> .depend
--- split.o ---
/usr/local/bin/x86_64-unknown-freebsd14.0-gcc13 --sysroot=3D/tmp/obj/worksp=
ace/src/amd64.amd64/tmp -B/usr/local/x86_64-unknown-freebsd14.0/bin/  -O2 -=
pipe -fno-common   -fPIE -g -MD  -MF.depend.split.o -MTsplit.o -std=3Dgnu99=
 -Wno-format-zero-length -fstack-protector-strong -Wsystem-headers -Werror =
-Wall -Wno-format-y2k -W -Wno-unused-parameter -Wmissing-prototypes -Wpoint=
er-arith -Wreturn-type -Wcast-qual -Wwrite-strings -Wswitch -Wshadow -Wunus=
ed-parameter -Wcast-align -Wchar-subscripts -Wnested-externs -Wold-style-de=
finition -Wno-pointer-sign -Wdate-time -Wno-error=3Daddress -Wno-error=3Dar=
ray-bounds -Wno-error=3Dattributes -Wno-error=3Dbool-compare -Wno-error=3Dc=
ast-align -Wno-error=3Dclobbered -Wno-error=3Ddeprecated-declarations -Wno-=
error=3Denum-compare -Wno-error=3Dextra -Wno-error=3Dlogical-not-parenthese=
s -Wno-error=3Dstrict-aliasing -Wno-error=3Duninitialized -Wno-error=3Dunus=
ed-function -Wno-error=3Dunused-value -Wno-error=3Dempty-body -Wno-error=3D=
maybe-uninitialized -Wno-error=3Dnonnull-compare -Wno-error=3Dshift-negativ=
e-value -Wno-error=3Dtautological-compare -Wno-error=3Dunused-const-variabl=
e -Wno-error=3Dbool-operation -Wno-error=3Ddeprecated -Wno-error=3Dexpansio=
n-to-defined -Wno-error=3Dformat-overflow -Wno-error=3Dformat-truncation -W=
no-error=3Dimplicit-fallthrough -Wno-error=3Dint-in-bool-context -Wno-error=
=3Dmemset-elt-size -Wno-error=3Dnoexcept-type -Wno-error=3Dnonnull -Wno-err=
or=3Dpointer-compare -Wno-error=3Dstringop-overflow -Wno-error=3Daggressive=
-loop-optimizations -Wno-error=3Dcast-function-type -Wno-error=3Dcatch-valu=
e -Wno-error=3Dmultistatement-macros -Wno-error=3Drestrict -Wno-error=3Dsiz=
eof-pointer-memaccess -Wno-error=3Dstringop-truncation -Wno-return-type    =
    -c /workspace/src/usr.bin/split/split.c -o split.o
--- all_subdir_usr.sbin ---
--- bthidd.full ---
/usr/local/bin/x86_64-unknown-freebsd14.0-gcc13 --sysroot=3D/tmp/obj/worksp=
ace/src/amd64.amd64/tmp -B/usr/local/x86_64-unknown-freebsd14.0/bin/ -O2 -p=
ipe -fno-common -I/workspace/src/usr.sbin/bluetooth/bthidd -fPIE -g -std=3D=
gnu99 -Wno-format-zero-length -fstack-protector-strong -Wsystem-headers -We=
rror -Wall -Wno-format-y2k -W -Wno-unused-parameter -Wmissing-prototypes -W=
pointer-arith -Wreturn-type -Wcast-qual -Wwrite-strings -Wswitch -Wshadow -=
Wunused-parameter -Wcast-align -Wchar-subscripts -Wnested-externs -Wold-sty=
le-definition -Wno-pointer-sign -Wdate-time -Wno-error=3Daddress -Wno-error=
=3Darray-bounds -Wno-error=3Dattributes -Wno-error=3Dbool-compare -Wno-erro=
r=3Dcast-align -Wno-error=3Dclobbered -Wno-error=3Ddeprecated-declarations =
-Wno-error=3Denum-compare -Wno-error=3Dextra -Wno-error=3Dlogical-not-paren=
theses -Wno-error=3Dstrict-aliasing -Wno-error=3Duninitialized -Wno-error=
=3Dunused-function -Wno-error=3Dunused-value -Wno-error=3Dempty-body -Wno-e=
rror=3Dmaybe-uninitialized -Wno-error=3Dnonnull-compare -Wno-error=3Dshift-=
negative-value -Wno-error=3Dtautological-compare -Wno-error=3Dunused-const-=
variable -Wno-error=3Dbool-operation -Wno-error=3Ddeprecated -Wno-error=3De=
xpansion-to-defined -Wno-error=3Dformat-overflow -Wno-error=3Dformat-trunca=
tion -Wno-error=3Dimplicit-fallthrough -Wno-error=3Dint-in-bool-context -Wn=
o-error=3Dmemset-elt-size -Wno-error=3Dnoexcept-type -Wno-error=3Dnonnull -=
Wno-error=3Dpointer-compare -Wno-error=3Dstringop-overflow -Wno-error=3Dagg=
ressive-loop-optimizations -Wno-error=3Dcast-function-type -Wno-error=3Dcat=
ch-value -Wno-error=3Dmultistatement-macros -Wno-error=3Drestrict -Wno-erro=
r=3Dsizeof-pointer-memaccess -Wno-error=3Dstringop-truncation -Wno-return-t=
ype  -Wl,-zrelro -pie -Wl,-znoexecstack   -o bthidd.full bthidd.o btuinput.=
o client.o hid.o kbd.o lexer.o parser.o server.o session.o   -lbluetooth  -=
lusbhid=20
--- bthidd.8.gz ---
gzip -cn /workspace/src/usr.sbin/bluetooth/bthidd/bthidd.8 > bthidd.8.gz
--- all_subdir_tests ---
--- last_local_modify ---
--- last_local_modify.full ---
/usr/local/bin/x86_64-unknown-freebsd14.0-g++13 --sysroot=3D/tmp/obj/worksp=
ace/src/amd64.amd64/tmp -B/usr/local/x86_64-unknown-freebsd14.0/bin/ -O2 -p=
ipe -fno-common -fPIE -g -Wno-format-zero-length -fstack-protector-strong -=
Wsystem-headers -Werror -Wall -Wno-format-y2k -W -Wno-unused-parameter -Wpo=
inter-arith -Wreturn-type -Wcast-qual -Wwrite-strings -Wswitch -Wshadow -Wu=
nused-parameter -Wcast-align -Wchar-subscripts -Wdate-time -Wno-error=3Dadd=
ress -Wno-error=3Darray-bounds -Wno-error=3Dattributes -Wno-error=3Dbool-co=
mpare -Wno-error=3Dcast-align -Wno-error=3Dclobbered -Wno-error=3Ddeprecate=
d-declarations -Wno-error=3Denum-compare -Wno-error=3Dextra -Wno-error=3Dlo=
gical-not-parentheses -Wno-error=3Dstrict-aliasing -Wno-error=3Duninitializ=
ed -Wno-error=3Dunused-function -Wno-error=3Dunused-value -Wno-error=3Dempt=
y-body -Wno-error=3Dmaybe-uninitialized -Wno-error=3Dnonnull-compare -Wno-e=
rror=3Dshift-negative-value -Wno-error=3Dtautological-compare -Wno-error=3D=
unused-const-variable -Wno-error=3Dbool-operation -Wno-error=3Ddeprecated -=
Wno-error=3Dexpansion-to-defined -Wno-error=3Dformat-overflow -Wno-error=3D=
format-truncation -Wno-error=3Dimplicit-fallthrough -Wno-error=3Dint-in-boo=
l-context -Wno-error=3Dmemset-elt-size -Wno-error=3Dnoexcept-type -Wno-erro=
r=3Dnonnull -Wno-error=3Dpointer-compare -Wno-error=3Dstringop-overflow -Wn=
o-error=3Daggressive-loop-optimizations -Wno-error=3Dcast-function-type -Wn=
o-error=3Dcatch-value -Wno-error=3Dmultistatement-macros -Wno-error=3Drestr=
ict -Wno-error=3Dsizeof-pointer-memaccess -Wno-error=3Dstringop-truncation =
-Wno-return-type -I/workspace/src/tests -I/workspace/src/sys/fs/fuse -I/wor=
kspace/src/sbin/mount -I/tmp/obj/workspace/src/amd64.amd64/tmp/usr/include/=
private -DGTEST_HAS_POSIX_RE=3D1 -DGTEST_HAS_PTHREAD=3D1 -DGTEST_HAS_STREAM=
_REDIRECTION=3D1 -frtti -fPIE -std=3Dc++14 -Wno-class-memaccess -Wno-deprec=
ated-copy -Wno-literal-suffix -Wno-error=3Dunknown-pragmas -Wno-dangling-re=
ference -Wno-placement-new -Wno-attributes -Wno-unused-but-set-variable  -W=
l,-zrelro -pie -Wl,-znoexecstack  -o last_local_modify.full  last_local_mod=
ify.o getmntopts.o mockfs.o utils.o  -lprivategmock -lprivategtest -lprivat=
egtest  -lutil -lpthread
--- all_subdir_usr.sbin ---
--- bthidd.debug ---
/usr/local/x86_64-unknown-freebsd14.0/bin/objcopy --only-keep-debug bthidd.=
full bthidd.debug
--- bthidd ---
/usr/local/x86_64-unknown-freebsd14.0/bin/objcopy --strip-debug --add-gnu-d=
ebuglink=3Dbthidd.debug  bthidd.full bthidd
--- all_subdir_usr.sbin/bluetooth/iwmbtfw ---
=3D=3D=3D> usr.sbin/bluetooth/iwmbtfw (all)
--- all_subdir_rescue ---
collect2: error: ld returned 1 exit status
*** [rescue] Error code 1

make[5]: stopped in /tmp/obj/workspace/src/amd64.amd64/rescue/rescue
1 error

make[5]: stopped in /tmp/obj/workspace/src/amd64.amd64/rescue/rescue
*** [rescue] Error code 2

make[4]: stopped in /workspace/src/rescue/rescue
--- all_subdir_usr.sbin ---
--- .depend ---
echo iwmbtfw.full: /tmp/obj/workspace/src/amd64.amd64/tmp/usr/lib/libc.a /t=
mp/obj/workspace/src/amd64.amd64/tmp/usr/lib/libusb.a >> .depend
--- all_subdir_rescue ---
1 error

make[4]: stopped in /workspace/src/rescue/rescue
--- all_subdir_tests ---

make[5]: stopped in /workspace/src/tests/sys/fs
--- all_subdir_usr.sbin ---

make[2]: stopped in /workspace/src
--- all_subdir_tests ---

make[4]: stopped in /workspace/src/tests/sys
--- all_subdir_rescue ---

make[3]: stopped in /workspace/src/rescue

make[2]: stopped in /workspace/src
--- all_subdir_tests ---

make[3]: stopped in /workspace/src/tests
--- all_subdir_lib ---

make[2]: stopped in /workspace/src
--- all_subdir_usr.bin ---

make[2]: stopped in /workspace/src
--- all_subdir_tests ---

make[2]: stopped in /workspace/src
      161.32 real      3000.18 user       275.39 sys

make[1]: stopped in /workspace/src

make: stopped in /workspace/src
Build step 'Execute shell' marked build as failure
[WARNINGS]Skipping publisher since build result is FAILURE
[PostBuildScript] - [INFO] Executing post build scripts.
[FreeBSD-main-amd64-gcc13_build] $ /bin/sh -xe /tmp/jenkins1783145964825741=
2232.sh
+ sh freebsd-ci/scripts/jail/clean.sh
clean jail FreeBSD-main-amd64-gcc13_build
Checking for post-build
Performing post-build step
Checking if email needs to be generated
Email was triggered for: Failure - Any
Sending email for trigger: Failure - Any
Sending mail from default account using System Admin e-mail address
------=_Part_1684_1776997397.1708548953602--



Want to link to this message? Use this URL: <https://mail-archive.FreeBSD.org/cgi/mid.cgi?783445723.1685.1708548955959>