Skip site navigation (1)Skip section navigation (2)
Date:      Mon, 24 Mar 2025 19:26:56 +0000 (GMT)
From:      jenkins-admin@FreeBSD.org
To:        emaste@FreeBSD.org, dev-ci@FreeBSD.org
Cc:        jenkins-admin@FreeBSD.org
Subject:   FreeBSD-main-amd64-test - Build #26125 - Still Unstable
Message-ID:  <1259865589.629.1742844416673@jenkins.ci.freebsd.org>
In-Reply-To: <2068957637.617.1742812669654@jenkins.ci.freebsd.org>
References:  <2068957637.617.1742812669654@jenkins.ci.freebsd.org>

next in thread | previous in thread | raw e-mail | index | archive | help
------=_Part_628_312600704.1742844416514
Content-Type: text/plain; charset=UTF-8
Content-Transfer-Encoding: 7bit

FreeBSD-main-amd64-test - Build #26125 (3209f63851b9e44b9d586857babe809cf7df6bfc) - Still Unstable

Build information: https://ci.FreeBSD.org/job/FreeBSD-main-amd64-test/26125/
Full change log: https://ci.FreeBSD.org/job/FreeBSD-main-amd64-test/26125/changes
Full build log: https://ci.FreeBSD.org/job/FreeBSD-main-amd64-test/26125/console

Status explanation:
"Unstable" - some tests are suspected being broken by the following changes
"Still Unstable" - the failing test cases have not been fixed by these
                   following changes and this is a notification to note that
                   these changes have not been fully tested by the CI system

Change summaries:
(Those commits are likely but not certainly responsible)

c40b323b91bdc0076922fcd6377f77da167de6af by emaste:
beep: Remove unnecessary include of src.opts.mk

3209f63851b9e44b9d586857babe809cf7df6bfc by emaste:
trim: Remove unnecessary include of src.opts.mk



The failed test cases:

7 tests failed.
FAILED:  bin.pwait.pwait_test.or_flag

Error Message:
atf-check failed; see the output of the test for details

FAILED:  sys.kern.coredump_phnum_test.coredump_phnum

Error Message:
atf-check failed; see the output of the test for details

FAILED:  sys.netipsec.tunnel.empty.v4

Error Message:
atf-check failed; see the output of the test for details

FAILED:  sys.netipsec.tunnel.empty.v6

Error Message:
atf-check failed; see the output of the test for details

FAILED:  sys.kern.ktrace_test.ktrace__cap_sockaddr

Error Message:
/usr/src/tests/sys/kern/ktrace_test.c:133: WEXITSTATUS(error) != status

FAILED:  sys.netinet.broadcast.INADDR_BROADCAST

Error Message:
/usr/src/tests/sys/netinet/broadcast.c:65: sending of broadcast failed: 51

FAILED:  sys.netinet.fibs_test.same_ip_multiple_ifaces_fib0

Error Message:
atf-check failed; see the output of the test for details
------=_Part_628_312600704.1742844416514--



Want to link to this message? Use this URL: <https://mail-archive.FreeBSD.org/cgi/mid.cgi?1259865589.629.1742844416673>