Skip site navigation (1)Skip section navigation (2)
Date:      Tue, 28 Jun 2022 16:48:40 +0000 (GMT)
From:      jenkins-admin@FreeBSD.org
To:        bz@FreeBSD.org, 0mp@FreeBSD.org, dev-ci@FreeBSD.org
Cc:        jenkins-admin@FreeBSD.org
Subject:   FreeBSD-main-amd64-test - Build #21550 - Still Unstable
Message-ID:  <1594383271.1961.1656434921648@jenkins.ci.freebsd.org>
In-Reply-To: <1376792074.1959.1656430634353@jenkins.ci.freebsd.org>
References:  <1376792074.1959.1656430634353@jenkins.ci.freebsd.org>

next in thread | previous in thread | raw e-mail | index | archive | help
------=_Part_1960_538948202.1656434920753
Content-Type: text/plain; charset=UTF-8
Content-Transfer-Encoding: 7bit

FreeBSD-main-amd64-test - Build #21550 (c618ee727712900105212af29b3ebf16b1076875) - Still Unstable

Build information: https://ci.FreeBSD.org/job/FreeBSD-main-amd64-test/21550/
Full change log: https://ci.FreeBSD.org/job/FreeBSD-main-amd64-test/21550/changes
Full build log: https://ci.FreeBSD.org/job/FreeBSD-main-amd64-test/21550/console

Status explanation:
"Unstable" - some tests are suspected being broken by the following changes
"Still Unstable" - the failing test cases have not been fixed by these
                   following changes and this is a notification to note that
                   these changes have not been fully tested by the CI system

Change summaries:
(Those commits are likely but not certainly responsible)

b11f52f4db4420f69da537e5ed9b54b7c4fef093 by bz:
USB: dwc3: use device_{has,get}_property()

ecd3759719fcf5d37dd44896ebae0534db0dedd5 by 0mp:
hier.7: Refer to build(7) for details about /usr/obj

bad2f716f4d3453fb9156b603cfaca44ea30fa31 by 0mp:
ftp: Use /var/spool/ftp as ftp's home consistently

c618ee727712900105212af29b3ebf16b1076875 by 0mp:
hier.7: Add some missing Xr's



The failed test cases:

3 tests failed.
FAILED:  sbin.growfs.legacy_test.main

Error Message:
6 of 19 tests failed

FAILED:  sys.geom.class.eli.resize_test.resize

Error Message:
atf-check failed; see the output of the test for details

FAILED:  usr.sbin.makefs.makefs_ffs_tests.autocalculate_image_size

Error Message:
atf-check failed; see the output of the test for details
------=_Part_1960_538948202.1656434920753--



Want to link to this message? Use this URL: <https://mail-archive.FreeBSD.org/cgi/mid.cgi?1594383271.1961.1656434921648>