Date: Wed, 29 Jun 2022 01:01:30 +0000 (GMT) From: jenkins-admin@FreeBSD.org To: 0mp@FreeBSD.org, dev-ci@FreeBSD.org Cc: jenkins-admin@FreeBSD.org Subject: FreeBSD-main-amd64-test - Build #21551 - Still Unstable Message-ID: <222344340.1981.1656464490922@jenkins.ci.freebsd.org> In-Reply-To: <1594383271.1961.1656434921648@jenkins.ci.freebsd.org> References: <1594383271.1961.1656434921648@jenkins.ci.freebsd.org>
next in thread | previous in thread | raw e-mail | index | archive | help
------=_Part_1980_960440776.1656464490611 Content-Type: text/plain; charset=UTF-8 Content-Transfer-Encoding: 7bit FreeBSD-main-amd64-test - Build #21551 (454adf0fa4d787bf6e6ff7be0aa6c27a91d2be8e) - Still Unstable Build information: https://ci.FreeBSD.org/job/FreeBSD-main-amd64-test/21551/ Full change log: https://ci.FreeBSD.org/job/FreeBSD-main-amd64-test/21551/changes Full build log: https://ci.FreeBSD.org/job/FreeBSD-main-amd64-test/21551/console Status explanation: "Unstable" - some tests are suspected being broken by the following changes "Still Unstable" - the failing test cases have not been fixed by these following changes and this is a notification to note that these changes have not been fully tested by the CI system Change summaries: (Those commits are likely but not certainly responsible) 454adf0fa4d787bf6e6ff7be0aa6c27a91d2be8e by 0mp: rc.conf.5: Fix example of how rc.conf.d works The failed test cases: 3 tests failed. FAILED: sbin.growfs.legacy_test.main Error Message: 6 of 19 tests failed FAILED: sys.geom.class.eli.resize_test.resize Error Message: atf-check failed; see the output of the test for details FAILED: usr.sbin.makefs.makefs_ffs_tests.autocalculate_image_size Error Message: atf-check failed; see the output of the test for details ------=_Part_1980_960440776.1656464490611--
Want to link to this message? Use this URL: <https://mail-archive.FreeBSD.org/cgi/mid.cgi?222344340.1981.1656464490922>