Skip site navigation (1)Skip section navigation (2)
Date:      Sun, 23 Mar 2025 16:39:25 +0000 (GMT)
From:      jenkins-admin@FreeBSD.org
To:        dev-ci@FreeBSD.org
Cc:        jenkins-admin@FreeBSD.org
Subject:   FreeBSD-main-amd64-test - Build #26118 - Still Unstable
Message-ID:  <74522765.489.1742747966006@jenkins.ci.freebsd.org>
In-Reply-To: <1396631602.487.1742741750323@jenkins.ci.freebsd.org>
References:  <1396631602.487.1742741750323@jenkins.ci.freebsd.org>

next in thread | previous in thread | raw e-mail | index | archive | help
------=_Part_488_1502154266.1742747965749
Content-Type: text/plain; charset=UTF-8
Content-Transfer-Encoding: 7bit

FreeBSD-main-amd64-test - Build #26118 (574816356834cb99295b124be0ec34bd9e0b9c72) - Still Unstable

Build information: https://ci.FreeBSD.org/job/FreeBSD-main-amd64-test/26118/
Full change log: https://ci.FreeBSD.org/job/FreeBSD-main-amd64-test/26118/changes
Full build log: https://ci.FreeBSD.org/job/FreeBSD-main-amd64-test/26118/console

Status explanation:
"Unstable" - some tests are suspected being broken by the following changes
"Still Unstable" - the failing test cases have not been fixed by these
                   following changes and this is a notification to note that
                   these changes have not been fully tested by the CI system

Change summaries:
(Those commits are likely but not certainly responsible)

No changes


The failed test cases:

7 tests failed.
FAILED:  sys.netpfil.pf.mbuf.inet6_in_mbuf_len

Error Message:
1 != 2 (1 != 2)

FAILED:  sys.kern.coredump_phnum_test.coredump_phnum

Error Message:
atf-check failed; see the output of the test for details

FAILED:  sys.netipsec.tunnel.empty.v4

Error Message:
atf-check failed; see the output of the test for details

FAILED:  sys.netipsec.tunnel.empty.v6

Error Message:
atf-check failed; see the output of the test for details

FAILED:  sys.kern.ktrace_test.ktrace__cap_sockaddr

Error Message:
/usr/src/tests/sys/kern/ktrace_test.c:133: WEXITSTATUS(error) != status

FAILED:  sys.netinet.broadcast.INADDR_BROADCAST

Error Message:
/usr/src/tests/sys/netinet/broadcast.c:65: sending of broadcast failed: 51

FAILED:  sys.netinet.fibs_test.same_ip_multiple_ifaces_fib0

Error Message:
atf-check failed; see the output of the test for details
------=_Part_488_1502154266.1742747965749--



Want to link to this message? Use this URL: <https://mail-archive.FreeBSD.org/cgi/mid.cgi?74522765.489.1742747966006>