Skip site navigation (1)Skip section navigation (2)
Date:      Sat, 7 Oct 2023 12:19:36 +0000 (GMT)
From:      jenkins-admin@FreeBSD.org
To:        emaste@FreeBSD.org, dev-ci@FreeBSD.org
Cc:        jenkins-admin@FreeBSD.org
Subject:   FreeBSD-main-amd64-test - Build #24220 - Still Unstable
Message-ID:  <796436054.5662.1696681177151@jenkins.ci.freebsd.org>
In-Reply-To: <647687895.5658.1696674191259@jenkins.ci.freebsd.org>
References:  <647687895.5658.1696674191259@jenkins.ci.freebsd.org>

next in thread | previous in thread | raw e-mail | index | archive | help
------=_Part_5661_50933596.1696681176835
Content-Type: text/plain; charset=UTF-8
Content-Transfer-Encoding: 7bit

FreeBSD-main-amd64-test - Build #24220 (f7a2eeaa75dc95f2958d2db2170744f44e14b7ea) - Still Unstable

Build information: https://ci.FreeBSD.org/job/FreeBSD-main-amd64-test/24220/
Full change log: https://ci.FreeBSD.org/job/FreeBSD-main-amd64-test/24220/changes
Full build log: https://ci.FreeBSD.org/job/FreeBSD-main-amd64-test/24220/console

Status explanation:
"Unstable" - some tests are suspected being broken by the following changes
"Still Unstable" - the failing test cases have not been fixed by these
                   following changes and this is a notification to note that
                   these changes have not been fully tested by the CI system

Change summaries:
(Those commits are likely but not certainly responsible)

f7a2eeaa75dc95f2958d2db2170744f44e14b7ea by emaste:
src.conf(5): regen after 166a655fcf13 (bsdinstall/libdialog)



The failed test cases:

3 tests failed.
FAILED:  sys.netinet6.frag6.frag6_19.frag6_19

Error Message:
Global IPv6 statistics do not match: 19 != 20

FAILED:  usr.bin.file.file_test.contrib_file_tests

Error Message:
atf-check failed; see the output of the test for details

FAILED:  sys.fs.tmpfs.times_test.empty

Error Message:
Incorrect atime
------=_Part_5661_50933596.1696681176835--



Want to link to this message? Use this URL: <https://mail-archive.FreeBSD.org/cgi/mid.cgi?796436054.5662.1696681177151>