Skip site navigation (1)Skip section navigation (2)
Date:      Mon, 22 Jan 2024 10:32:05 +0000 (GMT)
From:      jenkins-admin@FreeBSD.org
To:        kib@FreeBSD.org, dev-ci@FreeBSD.org
Cc:        jenkins-admin@FreeBSD.org
Subject:   FreeBSD-stable-14-amd64-test - Build #330 - Still Unstable
Message-ID:  <875452309.1053.1705919525942@jenkins.ci.freebsd.org>
In-Reply-To: <1977627163.1003.1705871333285@jenkins.ci.freebsd.org>
References:  <1977627163.1003.1705871333285@jenkins.ci.freebsd.org>

next in thread | previous in thread | raw e-mail | index | archive | help

FreeBSD-stable-14-amd64-test - Build #330 (0a586a7d756c47ef0e0171e32664467aea4279a0) - Still Unstable

Build information: https://ci.FreeBSD.org/job/FreeBSD-stable-14-amd64-test/330/
Full change log: https://ci.FreeBSD.org/job/FreeBSD-stable-14-amd64-test/330/changes
Full build log: https://ci.FreeBSD.org/job/FreeBSD-stable-14-amd64-test/330/console

Status explanation:
"Unstable" - some tests are suspected being broken by the following changes
"Still Unstable" - the failing test cases have not been fixed by these
                   following changes and this is a notification to note that
                   these changes have not been fully tested by the CI system

Change summaries:
(Those commits are likely but not certainly responsible)

0a586a7d756c47ef0e0171e32664467aea4279a0 by kib:
linuxkpi: correct zone item size for linux_mm_zone



The failed test cases:

3 tests failed.
FAILED:  sbin.ping.ping_test.inject_reply

Error Message:
atf-check failed; see the output of the test for details

FAILED:  sys.netpfil.pf.killstate.gateway

Error Message:
atf-check failed; see the output of the test for details

FAILED:  sys.netlink.test_netlink_message_writer.py.__test_cases_list__

Error Message:
Test program did not exit cleanly

Want to link to this message? Use this URL: <https://mail-archive.FreeBSD.org/cgi/mid.cgi?875452309.1053.1705919525942>