Skip site navigation (1)Skip section navigation (2)
Date:      Sun, 13 Apr 2025 03:14:46 +0000 (GMT)
From:      jenkins-admin@FreeBSD.org
To:        bz@FreeBSD.org, dev-ci@FreeBSD.org
Cc:        jenkins-admin@FreeBSD.org
Subject:   FreeBSD-main-amd64-test - Build #26243 - Still Unstable
Message-ID:  <1809491302.149.1744514086334@jenkins.ci.freebsd.org>
In-Reply-To: <1005727481.117.1744505496061@jenkins.ci.freebsd.org>
References:  <1005727481.117.1744505496061@jenkins.ci.freebsd.org>

next in thread | previous in thread | raw e-mail | index | archive | help
------=_Part_148_1820102726.1744514086162
Content-Type: text/plain; charset=UTF-8
Content-Transfer-Encoding: 7bit

FreeBSD-main-amd64-test - Build #26243 (63578bf225df37944b78febfb177e8c1c81f54e4) - Still Unstable

Build information: https://ci.FreeBSD.org/job/FreeBSD-main-amd64-test/26243/
Full change log: https://ci.FreeBSD.org/job/FreeBSD-main-amd64-test/26243/changes
Full build log: https://ci.FreeBSD.org/job/FreeBSD-main-amd64-test/26243/console

Status explanation:
"Unstable" - some tests are suspected being broken by the following changes
"Still Unstable" - the failing test cases have not been fixed by these
                   following changes and this is a notification to note that
                   these changes have not been fully tested by the CI system

Change summaries:
(Those commits are likely but not certainly responsible)

63578bf225df37944b78febfb177e8c1c81f54e4 by bz:
LinuxKPI: 802.11: enable fragmentation offload



The failed test cases:

4 tests failed.
FAILED:  sys.kqueue.libkqueue.kqueue_test.main

Error Message:
Returned non-success exit status 1

FAILED:  sys.audit.file-attribute-access.fhopen_failure

Error Message:
/usr/src/tests/sys/audit/file-attribute-access.c:468: Expected errno 22, got 14, in fhopen(NULL, O_CREAT) == -1

FAILED:  sys.netinet.broadcast.INADDR_BROADCAST

Error Message:
/usr/src/tests/sys/netinet/broadcast.c:65: sending of broadcast failed: 51

FAILED:  sys.netinet.fibs_test.same_ip_multiple_ifaces_fib0

Error Message:
atf-check failed; see the output of the test for details
------=_Part_148_1820102726.1744514086162--



Want to link to this message? Use this URL: <https://mail-archive.FreeBSD.org/cgi/mid.cgi?1809491302.149.1744514086334>