Date: Mon, 26 Sep 2022 15:27:59 +0000 (GMT) From: jenkins-admin@FreeBSD.org To: kp@FreeBSD.org, dev-ci@FreeBSD.org Cc: jenkins-admin@FreeBSD.org Subject: FreeBSD-main-amd64-test - Build #22156 - Still Unstable Message-ID: <1211264723.243.1664206080174@jenkins.ci.freebsd.org> In-Reply-To: <1596589487.237.1664199872073@jenkins.ci.freebsd.org> References: <1596589487.237.1664199872073@jenkins.ci.freebsd.org>
next in thread | previous in thread | raw e-mail | index | archive | help
------=_Part_242_826219674.1664206079878 Content-Type: text/plain; charset=UTF-8 Content-Transfer-Encoding: 7bit FreeBSD-main-amd64-test - Build #22156 (76e1c9c671043e08bdd951ae6c768b541fdede19) - Still Unstable Build information: https://ci.FreeBSD.org/job/FreeBSD-main-amd64-test/22156/ Full change log: https://ci.FreeBSD.org/job/FreeBSD-main-amd64-test/22156/changes Full build log: https://ci.FreeBSD.org/job/FreeBSD-main-amd64-test/22156/console Status explanation: "Unstable" - some tests are suspected being broken by the following changes "Still Unstable" - the failing test cases have not been fixed by these following changes and this is a notification to note that these changes have not been fully tested by the CI system Change summaries: (Those commits are likely but not certainly responsible) 76e1c9c671043e08bdd951ae6c768b541fdede19 by kp: if_ovpn: fix address family check when traffic class bits are set The failed test cases: 3 tests failed. FAILED: sys.netpfil.pf.killstate.gateway Error Message: atf-check failed; see the output of the test for details FAILED: sys.netpfil.pf.killstate.v4 Error Message: atf-check failed; see the output of the test for details FAILED: usr.bin.file.file_test.contrib_file_tests Error Message: atf-check failed; see the output of the test for details ------=_Part_242_826219674.1664206079878--
Want to link to this message? Use this URL: <https://mail-archive.FreeBSD.org/cgi/mid.cgi?1211264723.243.1664206080174>