Date: Wed, 5 Oct 2022 19:09:30 +0000 (GMT) From: jenkins-admin@FreeBSD.org To: kp@FreeBSD.org, dev-ci@FreeBSD.org Cc: jenkins-admin@FreeBSD.org Subject: FreeBSD-main-amd64-test - Build #22222 - Unstable Message-ID: <1652711438.1149.1664996970859@jenkins.ci.freebsd.org>
next in thread | raw e-mail | index | archive | help
------=_Part_1148_714686877.1664996970381 Content-Type: text/plain; charset=UTF-8 Content-Transfer-Encoding: 7bit FreeBSD-main-amd64-test - Build #22222 (1d090028d3037adffac6fde004b2ad035921bb49) - Unstable Build information: https://ci.FreeBSD.org/job/FreeBSD-main-amd64-test/22222/ Full change log: https://ci.FreeBSD.org/job/FreeBSD-main-amd64-test/22222/changes Full build log: https://ci.FreeBSD.org/job/FreeBSD-main-amd64-test/22222/console Status explanation: "Unstable" - some tests are suspected being broken by the following changes "Still Unstable" - the failing test cases have not been fixed by these following changes and this is a notification to note that these changes have not been fully tested by the CI system Change summaries: (Those commits are likely but not certainly responsible) 1d090028d3037adffac6fde004b2ad035921bb49 by kp: pf: use time_to for timestamps The failed test cases: 4 tests failed. FAILED: sys.netpfil.pf.killstate.gateway Error Message: atf-check failed; see the output of the test for details FAILED: sys.netpfil.pf.killstate.id Error Message: atf-check failed; see the output of the test for details FAILED: sys.netpfil.pf.killstate.interface Error Message: atf-check failed; see the output of the test for details FAILED: sys.netpfil.pf.killstate.multilabel Error Message: atf-check failed; see the output of the test for details ------=_Part_1148_714686877.1664996970381--
Want to link to this message? Use this URL: <https://mail-archive.FreeBSD.org/cgi/mid.cgi?1652711438.1149.1664996970859>