Date: Wed, 23 Nov 2022 17:07:56 +0000 (GMT) From: jenkins-admin@FreeBSD.org To: emaste@FreeBSD.org, dev-ci@FreeBSD.org Cc: jenkins-admin@FreeBSD.org Subject: FreeBSD-main-amd64-test - Build #22530 - Unstable Message-ID: <1147246007.4485.1669223277038@jenkins.ci.freebsd.org>
next in thread | raw e-mail | index | archive | help
------=_Part_4484_788610106.1669223276537 Content-Type: text/plain; charset=UTF-8 Content-Transfer-Encoding: 7bit FreeBSD-main-amd64-test - Build #22530 (eafafebe472872eb030d390e7acde16389a899ec) - Unstable Build information: https://ci.FreeBSD.org/job/FreeBSD-main-amd64-test/22530/ Full change log: https://ci.FreeBSD.org/job/FreeBSD-main-amd64-test/22530/changes Full build log: https://ci.FreeBSD.org/job/FreeBSD-main-amd64-test/22530/console Status explanation: "Unstable" - some tests are suspected being broken by the following changes "Still Unstable" - the failing test cases have not been fixed by these following changes and this is a notification to note that these changes have not been fully tested by the CI system Change summaries: (Those commits are likely but not certainly responsible) eafafebe472872eb030d390e7acde16389a899ec by emaste: compat32: retire now-unused MIPS support The failed test cases: 4 tests failed. FAILED: sys.fs.fusefs.mknod.main Error Message: Returned non-success exit status 1 FAILED: sys.kern.ktls_test.ktls_receive_aes128_gcm_1_2_bad_minor Error Message: /usr/src/tests/sys/kern/ktls_test.c:1511: errno == expected_error not met FAILED: sys.kern.ktls_test.ktls_receive_chacha20_poly1305_1_3_bad_major Error Message: /usr/src/tests/sys/kern/ktls_test.c:1511: errno == expected_error not met FAILED: sys.kern.ktls_test.ktls_receive_chacha20_poly1305_1_3_bad_minor Error Message: /usr/src/tests/sys/kern/ktls_test.c:1511: errno == expected_error not met ------=_Part_4484_788610106.1669223276537--
Want to link to this message? Use this URL: <https://mail-archive.FreeBSD.org/cgi/mid.cgi?1147246007.4485.1669223277038>