Skip site navigation (1)Skip section navigation (2)
Date:      Tue, 25 Mar 2025 05:25:13 +0000 (GMT)
From:      jenkins-admin@FreeBSD.org
To:        imp@FreeBSD.org, dev-ci@FreeBSD.org
Cc:        jenkins-admin@FreeBSD.org
Subject:   FreeBSD-stable-14-amd64-test - Build #1024 - Still Unstable
Message-ID:  <371288760.679.1742880313997@jenkins.ci.freebsd.org>
In-Reply-To: <863197490.601.1742805980164@jenkins.ci.freebsd.org>
References:  <863197490.601.1742805980164@jenkins.ci.freebsd.org>

next in thread | previous in thread | raw e-mail | index | archive | help
------=_Part_678_945391734.1742880313838
Content-Type: text/plain; charset=UTF-8
Content-Transfer-Encoding: 7bit

FreeBSD-stable-14-amd64-test - Build #1024 (d3a659a338cbad72bd205e6fc8787a9fb3fb485b) - Still Unstable

Build information: https://ci.FreeBSD.org/job/FreeBSD-stable-14-amd64-test/1024/
Full change log: https://ci.FreeBSD.org/job/FreeBSD-stable-14-amd64-test/1024/changes
Full build log: https://ci.FreeBSD.org/job/FreeBSD-stable-14-amd64-test/1024/console

Status explanation:
"Unstable" - some tests are suspected being broken by the following changes
"Still Unstable" - the failing test cases have not been fixed by these
                   following changes and this is a notification to note that
                   these changes have not been fully tested by the CI system

Change summaries:
(Those commits are likely but not certainly responsible)

d3a659a338cbad72bd205e6fc8787a9fb3fb485b by imp:
usb-msctest: Be more conservative setting GETMAXLUN quirk



The failed test cases:

6 tests failed.
FAILED:  sys.netipsec.tunnel.empty.v4

Error Message:
atf-check failed; see the output of the test for details

FAILED:  sys.netipsec.tunnel.empty.v6

Error Message:
atf-check failed; see the output of the test for details

FAILED:  lib.libc.gen.getentropy_test.getentropy_sizes

Error Message:
/usr/src/lib/libc/tests/gen/getentropy_test.c:65: errno != EIO

FAILED:  usr.bin.grep.grep_test.recurse_symlink

Error Message:
atf-check failed; see the output of the test for details

FAILED:  sys.netmap.ctrl-api-test.main

Error Message:
Returned non-success exit status 255

FAILED:  sys.netlink.test_netlink_message_writer.py.__test_cases_list__

Error Message:
Test program did not exit cleanly
------=_Part_678_945391734.1742880313838--



Want to link to this message? Use this URL: <https://mail-archive.FreeBSD.org/cgi/mid.cgi?371288760.679.1742880313997>