Date: Thu, 5 Jan 2023 07:14:10 +0000 (GMT) From: jenkins-admin@FreeBSD.org To: ganbold@FreeBSD.org, dev-ci@FreeBSD.org Cc: jenkins-admin@FreeBSD.org Subject: FreeBSD-main-amd64-test - Build #22745 - Still Unstable Message-ID: <1262155955.7139.1672902850854@jenkins.ci.freebsd.org> In-Reply-To: <1263421283.7119.1672884054887@jenkins.ci.freebsd.org> References: <1263421283.7119.1672884054887@jenkins.ci.freebsd.org>
next in thread | previous in thread | raw e-mail | index | archive | help
------=_Part_7138_1649777258.1672902850543 Content-Type: text/plain; charset=UTF-8 Content-Transfer-Encoding: 7bit FreeBSD-main-amd64-test - Build #22745 (7daf96523b378e08a513722bc5354400919ccf2b) - Still Unstable Build information: https://ci.FreeBSD.org/job/FreeBSD-main-amd64-test/22745/ Full change log: https://ci.FreeBSD.org/job/FreeBSD-main-amd64-test/22745/changes Full build log: https://ci.FreeBSD.org/job/FreeBSD-main-amd64-test/22745/console Status explanation: "Unstable" - some tests are suspected being broken by the following changes "Still Unstable" - the failing test cases have not been fixed by these following changes and this is a notification to note that these changes have not been fully tested by the CI system Change summaries: (Those commits are likely but not certainly responsible) 7daf96523b378e08a513722bc5354400919ccf2b by ganbold: Add PCIe driver for RK3568 SoC. The failed test cases: 3 tests failed. FAILED: sys.aio.aio_test.aio_socket_blocking_short_write Error Message: Test case body timed out FAILED: sys.aio.aio_test.aio_socket_blocking_short_write_vectored Error Message: Test case body timed out FAILED: sys.aio.aio_test.aio_socket_short_write_cancel Error Message: /usr/src/tests/sys/aio/aio_test.c:1396: aio_error(&iocb) == EINPROGRESS not met ------=_Part_7138_1649777258.1672902850543--
Want to link to this message? Use this URL: <https://mail-archive.FreeBSD.org/cgi/mid.cgi?1262155955.7139.1672902850854>