Skip site navigation (1)Skip section navigation (2)
Date:      Wed, 15 Mar 2023 21:50:12 +0000 (GMT)
From:      jenkins-admin@FreeBSD.org
To:        emaste@FreeBSD.org, dev-ci@FreeBSD.org
Cc:        jenkins-admin@FreeBSD.org
Subject:   FreeBSD-main-amd64-gcc12_build - Build #618 - Still Failing
Message-ID:  <1217778326.355.1678917014690@jenkins.ci.freebsd.org>
In-Reply-To: <1310324660.349.1678906002522@jenkins.ci.freebsd.org>
References:  <1310324660.349.1678906002522@jenkins.ci.freebsd.org>

next in thread | previous in thread | raw e-mail | index | archive | help
------=_Part_354_1716408145.1678917012859
Content-Type: text/plain; charset=UTF-8
Content-Transfer-Encoding: quoted-printable

FreeBSD-main-amd64-gcc12_build - Build #618 (6834ca8a434b1b934f21bbc068c90a=
e5c7fec7ef) - Still Failing

Build information: https://ci.FreeBSD.org/job/FreeBSD-main-amd64-gcc12_buil=
d/618/
Full change log: https://ci.FreeBSD.org/job/FreeBSD-main-amd64-gcc12_build/=
618/changes
Full build log: https://ci.FreeBSD.org/job/FreeBSD-main-amd64-gcc12_build/6=
18/console

Status explanation:
"Failure" - the build is suspected being broken by the following changes
"Still Failing" - the build has not been fixed by the following changes and
                  this is a notification to note that these changes have
                  not been fully tested by the CI system

Change summaries:
(Those commits are likely but not certainly responsible)

6834ca8a434b1b934f21bbc068c90ae5c7fec7ef by emaste:
ssh: update FREEBSD-upgrade instructions



The end of the build log:

[...truncated 82.45 MB...]
--- tp_test.full ---
/usr/local/bin/x86_64-unknown-freebsd13.1-gcc12 --sysroot=3D/tmp/obj/worksp=
ace/src/amd64.amd64/tmp -B/usr/local/x86_64-unknown-freebsd13.1/bin/ -O2 -p=
ipe -fno-common -DHAVE_CONFIG_H -DATF_BUILD_CC=3D'"cc"' -DATF_BUILD_CFLAGS=
=3D'"-Wall"' -DATF_BUILD_CPP=3D'"cpp"' -DATF_BUILD_CPPFLAGS=3D'""' -DATF_BU=
ILD_CXX=3D'"c++"' -DATF_BUILD_CXXFLAGS=3D'"-Wall"' -DATF_INCLUDEDIR=3D'"/us=
r/include"' -I/workspace/src/contrib/atf -DHAVE_CONFIG_H -DATF_BUILD_CC=3D'=
"cc"' -DATF_BUILD_CFLAGS=3D'"-Wall"' -DATF_BUILD_CPP=3D'"cpp"' -DATF_BUILD_=
CPPFLAGS=3D'""' -DATF_BUILD_CXX=3D'"c++"' -DATF_BUILD_CXXFLAGS=3D'"-Wall"' =
-fPIE -g -std=3Dgnu99 -Wno-format-zero-length -fstack-protector-strong -Wsy=
stem-headers -Werror -Wall -Wno-format-y2k -W -Wno-unused-parameter -Wmissi=
ng-prototypes -Wpointer-arith -Wno-uninitialized -Wno-pointer-sign -Wdate-t=
ime -Wno-error=3Daddress -Wno-error=3Darray-bounds -Wno-error=3Dattributes =
-Wno-error=3Dbool-compare -Wno-error=3Dcast-align -Wno-error=3Dclobbered -W=
no-error=3Ddeprecated-declarations -Wno-error=3Denum-compare -Wno-error=3De=
xtra -Wno-error=3Dlogical-not-parentheses -Wno-error=3Dstrict-aliasing -Wno=
-error=3Duninitialized -Wno-error=3Dunused-but-set-variable -Wno-error=3Dun=
used-function -Wno-error=3Dunused-value -Wno-error=3Dempty-body -Wno-error=
=3Dmaybe-uninitialized -Wno-error=3Dnonnull-compare -Wno-error=3Dshift-nega=
tive-value -Wno-error=3Dtautological-compare -Wno-error=3Dunused-const-vari=
able -Wno-error=3Dbool-operation -Wno-error=3Ddeprecated -Wno-error=3Dexpan=
sion-to-defined -Wno-error=3Dformat-overflow -Wno-error=3Dformat-truncation=
 -Wno-error=3Dimplicit-fallthrough -Wno-error=3Dint-in-bool-context -Wno-er=
ror=3Dmemset-elt-size -Wno-error=3Dnoexcept-type -Wno-error=3Dnonnull -Wno-=
error=3Dpointer-compare -Wno-error=3Dstringop-overflow -Wno-error=3Daggress=
ive-loop-optimizations -Wno-error=3Dcast-function-type -Wno-error=3Dcatch-v=
alue -Wno-error=3Dmultistatement-macros -Wno-error=3Drestrict -Wno-error=3D=
sizeof-pointer-memaccess -Wno-error=3Dstringop-truncation -Wno-return-type =
-Wno-address-of-packed-member  -Wl,-zrelro -pie  -o tp_test.full tp_test.o =
test_helpers.o  -lprivateatf-c
--- all_subdir_usr.bin ---
/usr/local/bin/x86_64-unknown-freebsd13.1-gcc12 --sysroot=3D/tmp/obj/worksp=
ace/src/amd64.amd64/tmp -B/usr/local/x86_64-unknown-freebsd13.1/bin/ -O2 -p=
ipe -fno-common -fPIE -g -std=3Dgnu99 -Wno-format-zero-length -fstack-prote=
ctor-strong -Wsystem-headers -Werror -Wall -Wno-format-y2k -W -Wno-unused-p=
arameter -Wmissing-prototypes -Wpointer-arith -Wreturn-type -Wcast-qual -Ww=
rite-strings -Wswitch -Wshadow -Wunused-parameter -Wcast-align -Wchar-subsc=
ripts -Wnested-externs -Wold-style-definition -Wno-pointer-sign -Wdate-time=
 -Wno-error=3Daddress -Wno-error=3Darray-bounds -Wno-error=3Dattributes -Wn=
o-error=3Dbool-compare -Wno-error=3Dcast-align -Wno-error=3Dclobbered -Wno-=
error=3Ddeprecated-declarations -Wno-error=3Denum-compare -Wno-error=3Dextr=
a -Wno-error=3Dlogical-not-parentheses -Wno-error=3Dstrict-aliasing -Wno-er=
ror=3Duninitialized -Wno-error=3Dunused-but-set-variable -Wno-error=3Dunuse=
d-function -Wno-error=3Dunused-value -Wno-error=3Dempty-body -Wno-error=3Dm=
aybe-uninitialized -Wno-error=3Dnonnull-compare -Wno-error=3Dshift-negative=
-value -Wno-error=3Dtautological-compare -Wno-error=3Dunused-const-variable=
 -Wno-error=3Dbool-operation -Wno-error=3Ddeprecated -Wno-error=3Dexpansion=
-to-defined -Wno-error=3Dformat-overflow -Wno-error=3Dformat-truncation -Wn=
o-error=3Dimplicit-fallthrough -Wno-error=3Dint-in-bool-context -Wno-error=
=3Dmemset-elt-size -Wno-error=3Dnoexcept-type -Wno-error=3Dnonnull -Wno-err=
or=3Dpointer-compare -Wno-error=3Dstringop-overflow -Wno-error=3Daggressive=
-loop-optimizations -Wno-error=3Dcast-function-type -Wno-error=3Dcatch-valu=
e -Wno-error=3Dmultistatement-macros -Wno-error=3Drestrict -Wno-error=3Dsiz=
eof-pointer-memaccess -Wno-error=3Dstringop-truncation -Wno-return-type  -W=
l,-zrelro -pie  -o while1.full while1.o =20
--- all_subdir_usr.sbin ---
--- all_subdir_usr.sbin/acpi ---
--- rscalc.o ---
/usr/local/bin/x86_64-unknown-freebsd13.1-gcc12 --sysroot=3D/tmp/obj/worksp=
ace/src/amd64.amd64/tmp -B/usr/local/x86_64-unknown-freebsd13.1/bin/  -O2 -=
pipe -fno-common -DACPI_DB_APP -DACPI_EXEC_APP -fno-strict-aliasing   -I/wo=
rkspace/src/sys -fPIE -g -MD  -MF.depend.rscalc.o -MTrscalc.o -std=3Dgnu99 =
-Wno-format-zero-length -fstack-protector-strong -Wsystem-headers -Werror -=
Wall -Wno-format-y2k -W -Wno-unused-parameter -Wmissing-prototypes -Wpointe=
r-arith -Wno-uninitialized -Wno-pointer-sign -Wdate-time -Wno-error=3Daddre=
ss -Wno-error=3Darray-bounds -Wno-error=3Dattributes -Wno-error=3Dbool-comp=
are -Wno-error=3Dcast-align -Wno-error=3Dclobbered -Wno-error=3Ddeprecated-=
declarations -Wno-error=3Denum-compare -Wno-error=3Dextra -Wno-error=3Dlogi=
cal-not-parentheses -Wno-error=3Dstrict-aliasing -Wno-error=3Duninitialized=
 -Wno-error=3Dunused-but-set-variable -Wno-error=3Dunused-function -Wno-err=
or=3Dunused-value -Wno-error=3Dempty-body -Wno-error=3Dmaybe-uninitialized =
-Wno-error=3Dnonnull-compare -Wno-error=3Dshift-negative-value -Wno-error=
=3Dtautological-compare -Wno-error=3Dunused-const-variable -Wno-error=3Dboo=
l-operation -Wno-error=3Ddeprecated -Wno-error=3Dexpansion-to-defined -Wno-=
error=3Dformat-overflow -Wno-error=3Dformat-truncation -Wno-error=3Dimplici=
t-fallthrough -Wno-error=3Dint-in-bool-context -Wno-error=3Dmemset-elt-size=
 -Wno-error=3Dnoexcept-type -Wno-error=3Dnonnull -Wno-error=3Dpointer-compa=
re -Wno-error=3Dstringop-overflow -Wno-error=3Daggressive-loop-optimization=
s -Wno-error=3Dcast-function-type -Wno-error=3Dcatch-value -Wno-error=3Dmul=
tistatement-macros -Wno-error=3Drestrict -Wno-error=3Dsizeof-pointer-memacc=
ess -Wno-error=3Dstringop-truncation -Wno-return-type -Wno-address-of-packe=
d-member      -c /workspace/src/sys/contrib/dev/acpica/components/resources=
/rscalc.c -o rscalc.o
--- all_subdir_usr.bin ---
--- while1.debug ---
/usr/local/x86_64-unknown-freebsd13.1/bin/objcopy --only-keep-debug while1.=
full while1.debug
--- all_subdir_lib ---
--- tp_test.debug ---
--- all_subdir_usr.bin ---
--- while1 ---
/usr/local/x86_64-unknown-freebsd13.1/bin/objcopy --strip-debug --add-gnu-d=
ebuglink=3Dwhile1.debug  while1.full while1
--- all_subdir_lib ---
/usr/local/x86_64-unknown-freebsd13.1/bin/objcopy --only-keep-debug tp_test=
.full tp_test.debug
--- all_subdir_usr.bin ---
--- procstat_test ---
--- all_subdir_lib ---
--- tp_test ---
--- all_subdir_usr.bin ---
echo '#! /usr/libexec/atf-sh' > procstat_test.tmp
cat /workspace/src/usr.bin/procstat/tests/procstat_test.sh >>procstat_test.=
tmp
--- all_subdir_lib ---
/usr/local/x86_64-unknown-freebsd13.1/bin/objcopy --strip-debug --add-gnu-d=
ebuglink=3Dtp_test.debug  tp_test.full tp_test
--- all_subdir_usr.bin ---
chmod +x procstat_test.tmp
mv procstat_test.tmp procstat_test
--- Kyuafile ---
--- all_subdir_lib ---
--- utils_test ---
(cd /workspace/src/lib/atf/libatf-c/tests &&  DEPENDFILE=3D.depend.utils_te=
st  NO_SUBDIR=3D1 make -f /workspace/src/lib/atf/libatf-c/tests/Makefile _R=
ECURSING_PROGS=3Dt  PROG=3Dutils_test )
--- all_subdir_usr.bin ---
--- procstat.full ---
/usr/local/bin/x86_64-unknown-freebsd13.1-gcc12 --sysroot=3D/tmp/obj/worksp=
ace/src/amd64.amd64/tmp -B/usr/local/x86_64-unknown-freebsd13.1/bin/ -O2 -p=
ipe -fno-common -fPIE -g -std=3Dgnu99 -Wno-format-zero-length -fstack-prote=
ctor-strong -Wsystem-headers -Werror -Wall -Wno-format-y2k -W -Wno-unused-p=
arameter -Wmissing-prototypes -Wpointer-arith -Wreturn-type -Wcast-qual -Ww=
rite-strings -Wswitch -Wshadow -Wunused-parameter -Wcast-align -Wchar-subsc=
ripts -Wnested-externs -Wold-style-definition -Wno-pointer-sign -Wdate-time=
 -Wno-error=3Daddress -Wno-error=3Darray-bounds -Wno-error=3Dattributes -Wn=
o-error=3Dbool-compare -Wno-error=3Dcast-align -Wno-error=3Dclobbered -Wno-=
error=3Ddeprecated-declarations -Wno-error=3Denum-compare -Wno-error=3Dextr=
a -Wno-error=3Dlogical-not-parentheses -Wno-error=3Dstrict-aliasing -Wno-er=
ror=3Duninitialized -Wno-error=3Dunused-but-set-variable -Wno-error=3Dunuse=
d-function -Wno-error=3Dunused-value -Wno-error=3Dempty-body -Wno-error=3Dm=
aybe-uninitialized -Wno-error=3Dnonnull-compare -Wno-error=3Dshift-negative=
-value -Wno-error=3Dtautological-compare -Wno-error=3Dunused-const-variable=
 -Wno-error=3Dbool-operation -Wno-error=3Ddeprecated -Wno-error=3Dexpansion=
-to-defined -Wno-error=3Dformat-overflow -Wno-error=3Dformat-truncation -Wn=
o-error=3Dimplicit-fallthrough -Wno-error=3Dint-in-bool-context -Wno-error=
=3Dmemset-elt-size -Wno-error=3Dnoexcept-type -Wno-error=3Dnonnull -Wno-err=
or=3Dpointer-compare -Wno-error=3Dstringop-overflow -Wno-error=3Daggressive=
-loop-optimizations -Wno-error=3Dcast-function-type -Wno-error=3Dcatch-valu=
e -Wno-error=3Dmultistatement-macros -Wno-error=3Drestrict -Wno-error=3Dsiz=
eof-pointer-memaccess -Wno-error=3Dstringop-truncation -Wno-return-type  -W=
l,-zrelro -pie   -o procstat.full procstat.o procstat_advlock.o procstat_ar=
gs.o procstat_auxv.o procstat_basic.o procstat_bin.o procstat_cred.o procst=
at_cs.o procstat_files.o procstat_kstack.o procstat_penv.o procstat_ptlwpin=
fo.o procstat_pwdx.o procstat_rlimit.o procstat_rusage.o procstat_sigs.o pr=
ocstat_threads.o procstat_vm.o   -lprocstat  -lxo  -lutil  -lsbuf=20
--- all_subdir_lib ---
--- .depend.utils_test ---
echo utils_test.full: /tmp/obj/workspace/src/amd64.amd64/tmp/usr/lib/libc.a=
 /tmp/obj/workspace/src/amd64.amd64/tmp/usr/lib/libprivateatf-c.a >> .depen=
d.utils_test
--- utils_test.o ---
/usr/local/bin/x86_64-unknown-freebsd13.1-gcc12 --sysroot=3D/tmp/obj/worksp=
ace/src/amd64.amd64/tmp -B/usr/local/x86_64-unknown-freebsd13.1/bin/  -O2 -=
pipe -fno-common   -DHAVE_CONFIG_H -DATF_BUILD_CC=3D'"cc"' -DATF_BUILD_CFLA=
GS=3D'"-Wall"' -DATF_BUILD_CPP=3D'"cpp"' -DATF_BUILD_CPPFLAGS=3D'""' -DATF_=
BUILD_CXX=3D'"c++"' -DATF_BUILD_CXXFLAGS=3D'"-Wall"' -DATF_INCLUDEDIR=3D'"/=
usr/include"' -I/workspace/src/contrib/atf -DHAVE_CONFIG_H -DATF_BUILD_CC=
=3D'"cc"' -DATF_BUILD_CFLAGS=3D'"-Wall"' -DATF_BUILD_CPP=3D'"cpp"' -DATF_BU=
ILD_CPPFLAGS=3D'""' -DATF_BUILD_CXX=3D'"c++"' -DATF_BUILD_CXXFLAGS=3D'"-Wal=
l"' -fPIE -g -MD  -MF.depend.utils_test.utils_test.o -MTutils_test.o -std=
=3Dgnu99 -Wno-format-zero-length -fstack-protector-strong -Wsystem-headers =
-Werror -Wall -Wno-format-y2k -W -Wno-unused-parameter -Wmissing-prototypes=
 -Wpointer-arith -Wno-uninitialized -Wno-pointer-sign -Wdate-time -Wno-erro=
r=3Daddress -Wno-error=3Darray-bounds -Wno-error=3Dattributes -Wno-error=3D=
bool-compare -Wno-error=3Dcast-align -Wno-error=3Dclobbered -Wno-error=3Dde=
precated-declarations -Wno-error=3Denum-compare -Wno-error=3Dextra -Wno-err=
or=3Dlogical-not-parentheses -Wno-error=3Dstrict-aliasing -Wno-error=3Dunin=
itialized -Wno-error=3Dunused-but-set-variable -Wno-error=3Dunused-function=
 -Wno-error=3Dunused-value -Wno-error=3Dempty-body -Wno-error=3Dmaybe-unini=
tialized -Wno-error=3Dnonnull-compare -Wno-error=3Dshift-negative-value -Wn=
o-error=3Dtautological-compare -Wno-error=3Dunused-const-variable -Wno-erro=
r=3Dbool-operation -Wno-error=3Ddeprecated -Wno-error=3Dexpansion-to-define=
d -Wno-error=3Dformat-overflow -Wno-error=3Dformat-truncation -Wno-error=3D=
implicit-fallthrough -Wno-error=3Dint-in-bool-context -Wno-error=3Dmemset-e=
lt-size -Wno-error=3Dnoexcept-type -Wno-error=3Dnonnull -Wno-error=3Dpointe=
r-compare -Wno-error=3Dstringop-overflow -Wno-error=3Daggressive-loop-optim=
izations -Wno-error=3Dcast-function-type -Wno-error=3Dcatch-value -Wno-erro=
r=3Dmultistatement-macros -Wno-error=3Drestrict -Wno-error=3Dsizeof-pointer=
-memaccess -Wno-error=3Dstringop-truncation -Wno-return-type -Wno-address-o=
f-packed-member    -c /workspace/src/contrib/atf/atf-c/utils_test.c -o util=
s_test.o
--- all_subdir_usr.bin ---
--- procstat.1.gz ---
gzip -cn /workspace/src/usr.bin/procstat/procstat.1 > procstat.1.gz
--- procstat.debug ---
/usr/local/x86_64-unknown-freebsd13.1/bin/objcopy --only-keep-debug procsta=
t.full procstat.debug
--- procstat ---
/usr/local/x86_64-unknown-freebsd13.1/bin/objcopy --strip-debug --add-gnu-d=
ebuglink=3Dprocstat.debug  procstat.full procstat
--- all_subdir_usr.bin/protect ---
=3D=3D=3D> usr.bin/protect (all)
--- .depend ---
echo protect.full: /tmp/obj/workspace/src/amd64.amd64/tmp/usr/lib/libc.a  >=
> .depend
--- protect.o ---
/usr/local/bin/x86_64-unknown-freebsd13.1-gcc12 --sysroot=3D/tmp/obj/worksp=
ace/src/amd64.amd64/tmp -B/usr/local/x86_64-unknown-freebsd13.1/bin/  -O2 -=
pipe -fno-common   -fPIE -g -MD  -MF.depend.protect.o -MTprotect.o -std=3Dg=
nu99 -Wno-format-zero-length -fstack-protector-strong -Wsystem-headers -Wer=
ror -Wall -Wno-format-y2k -W -Wno-unused-parameter -Wmissing-prototypes -Wp=
ointer-arith -Wreturn-type -Wcast-qual -Wwrite-strings -Wswitch -Wshadow -W=
unused-parameter -Wcast-align -Wchar-subscripts -Wnested-externs -Wold-styl=
e-definition -Wno-pointer-sign -Wdate-time -Wno-error=3Daddress -Wno-error=
=3Darray-bounds -Wno-error=3Dattributes -Wno-error=3Dbool-compare -Wno-erro=
r=3Dcast-align -Wno-error=3Dclobbered -Wno-error=3Ddeprecated-declarations =
-Wno-error=3Denum-compare -Wno-error=3Dextra -Wno-error=3Dlogical-not-paren=
theses -Wno-error=3Dstrict-aliasing -Wno-error=3Duninitialized -Wno-error=
=3Dunused-but-set-variable -Wno-error=3Dunused-function -Wno-error=3Dunused=
-value -Wno-error=3Dempty-body -Wno-error=3Dmaybe-uninitialized -Wno-error=
=3Dnonnull-compare -Wno-error=3Dshift-negative-value -Wno-error=3Dtautologi=
cal-compare -Wno-error=3Dunused-const-variable -Wno-error=3Dbool-operation =
-Wno-error=3Ddeprecated -Wno-error=3Dexpansion-to-defined -Wno-error=3Dform=
at-overflow -Wno-error=3Dformat-truncation -Wno-error=3Dimplicit-fallthroug=
h -Wno-error=3Dint-in-bool-context -Wno-error=3Dmemset-elt-size -Wno-error=
=3Dnoexcept-type -Wno-error=3Dnonnull -Wno-error=3Dpointer-compare -Wno-err=
or=3Dstringop-overflow -Wno-error=3Daggressive-loop-optimizations -Wno-erro=
r=3Dcast-function-type -Wno-error=3Dcatch-value -Wno-error=3Dmultistatement=
-macros -Wno-error=3Drestrict -Wno-error=3Dsizeof-pointer-memaccess -Wno-er=
ror=3Dstringop-truncation -Wno-return-type       -c /workspace/src/usr.bin/=
protect/protect.c -o protect.o
--- protect.full ---
/usr/local/bin/x86_64-unknown-freebsd13.1-gcc12 --sysroot=3D/tmp/obj/worksp=
ace/src/amd64.amd64/tmp -B/usr/local/x86_64-unknown-freebsd13.1/bin/ -O2 -p=
ipe -fno-common -fPIE -g -std=3Dgnu99 -Wno-format-zero-length -fstack-prote=
ctor-strong -Wsystem-headers -Werror -Wall -Wno-format-y2k -W -Wno-unused-p=
arameter -Wmissing-prototypes -Wpointer-arith -Wreturn-type -Wcast-qual -Ww=
rite-strings -Wswitch -Wshadow -Wunused-parameter -Wcast-align -Wchar-subsc=
ripts -Wnested-externs -Wold-style-definition -Wno-pointer-sign -Wdate-time=
 -Wno-error=3Daddress -Wno-error=3Darray-bounds -Wno-error=3Dattributes -Wn=
o-error=3Dbool-compare -Wno-error=3Dcast-align -Wno-error=3Dclobbered -Wno-=
error=3Ddeprecated-declarations -Wno-error=3Denum-compare -Wno-error=3Dextr=
a -Wno-error=3Dlogical-not-parentheses -Wno-error=3Dstrict-aliasing -Wno-er=
ror=3Duninitialized -Wno-error=3Dunused-but-set-variable -Wno-error=3Dunuse=
d-function -Wno-error=3Dunused-value -Wno-error=3Dempty-body -Wno-error=3Dm=
aybe-uninitialized -Wno-error=3Dnonnull-compare -Wno-error=3Dshift-negative=
-value -Wno-error=3Dtautological-compare -Wno-error=3Dunused-const-variable=
 -Wno-error=3Dbool-operation -Wno-error=3Ddeprecated -Wno-error=3Dexpansion=
-to-defined -Wno-error=3Dformat-overflow -Wno-error=3Dformat-truncation -Wn=
o-error=3Dimplicit-fallthrough -Wno-error=3Dint-in-bool-context -Wno-error=
=3Dmemset-elt-size -Wno-error=3Dnoexcept-type -Wno-error=3Dnonnull -Wno-err=
or=3Dpointer-compare -Wno-error=3Dstringop-overflow -Wno-error=3Daggressive=
-loop-optimizations -Wno-error=3Dcast-function-type -Wno-error=3Dcatch-valu=
e -Wno-error=3Dmultistatement-macros -Wno-error=3Drestrict -Wno-error=3Dsiz=
eof-pointer-memaccess -Wno-error=3Dstringop-truncation -Wno-return-type  -W=
l,-zrelro -pie   -o protect.full protect.o =20
--- protect.1.gz ---
gzip -cn /workspace/src/usr.bin/protect/protect.1 > protect.1.gz
--- protect.debug ---
/usr/local/x86_64-unknown-freebsd13.1/bin/objcopy --only-keep-debug protect=
.full protect.debug
--- protect ---
/usr/local/x86_64-unknown-freebsd13.1/bin/objcopy --strip-debug --add-gnu-d=
ebuglink=3Dprotect.debug  protect.full protect
--- all_subdir_usr.bin/rctl ---
=3D=3D=3D> usr.bin/rctl (all)
--- .depend ---
--- all_subdir_usr.sbin ---
--- rscreate.o ---
--- all_subdir_usr.bin ---
echo rctl.full: /tmp/obj/workspace/src/amd64.amd64/tmp/usr/lib/libc.a /tmp/=
obj/workspace/src/amd64.amd64/tmp/usr/lib/libutil.a >> .depend
--- rctl.o ---
--- all_subdir_usr.sbin ---
/usr/local/bin/x86_64-unknown-freebsd13.1-gcc12 --sysroot=3D/tmp/obj/worksp=
ace/src/amd64.amd64/tmp -B/usr/local/x86_64-unknown-freebsd13.1/bin/  -O2 -=
pipe -fno-common -DACPI_DB_APP -DACPI_EXEC_APP -fno-strict-aliasing   -I/wo=
rkspace/src/sys -fPIE -g -MD  -MF.depend.rscreate.o -MTrscreate.o -std=3Dgn=
u99 -Wno-format-zero-length -fstack-protector-strong -Wsystem-headers -Werr=
or -Wall -Wno-format-y2k -W -Wno-unused-parameter -Wmissing-prototypes -Wpo=
inter-arith -Wno-uninitialized -Wno-pointer-sign -Wdate-time -Wno-error=3Da=
ddress -Wno-error=3Darray-bounds -Wno-error=3Dattributes -Wno-error=3Dbool-=
compare -Wno-error=3Dcast-align -Wno-error=3Dclobbered -Wno-error=3Ddepreca=
ted-declarations -Wno-error=3Denum-compare -Wno-error=3Dextra -Wno-error=3D=
logical-not-parentheses -Wno-error=3Dstrict-aliasing -Wno-error=3Duninitial=
ized -Wno-error=3Dunused-but-set-variable -Wno-error=3Dunused-function -Wno=
-error=3Dunused-value -Wno-error=3Dempty-body -Wno-error=3Dmaybe-uninitiali=
zed -Wno-error=3Dnonnull-compare -Wno-error=3Dshift-negative-value -Wno-err=
or=3Dtautological-compare -Wno-error=3Dunused-const-variable -Wno-error=3Db=
ool-operation -Wno-error=3Ddeprecated -Wno-error=3Dexpansion-to-defined -Wn=
o-error=3Dformat-overflow -Wno-error=3Dformat-truncation -Wno-error=3Dimpli=
cit-fallthrough -Wno-error=3Dint-in-bool-context -Wno-error=3Dmemset-elt-si=
ze -Wno-error=3Dnoexcept-type -Wno-error=3Dnonnull -Wno-error=3Dpointer-com=
pare -Wno-error=3Dstringop-overflow -Wno-error=3Daggressive-loop-optimizati=
ons -Wno-error=3Dcast-function-type -Wno-error=3Dcatch-value -Wno-error=3Dm=
ultistatement-macros -Wno-error=3Drestrict -Wno-error=3Dsizeof-pointer-mema=
ccess -Wno-error=3Dstringop-truncation -Wno-return-type -Wno-address-of-pac=
ked-member      -c /workspace/src/sys/contrib/dev/acpica/components/resourc=
es/rscreate.c -o rscreate.o
--- all_subdir_usr.bin ---
/usr/local/bin/x86_64-unknown-freebsd13.1-gcc12 --sysroot=3D/tmp/obj/worksp=
ace/src/amd64.amd64/tmp -B/usr/local/x86_64-unknown-freebsd13.1/bin/  -O2 -=
pipe -fno-common   -fPIE -g -MD  -MF.depend.rctl.o -MTrctl.o -std=3Dgnu99 -=
Wno-format-zero-length -fstack-protector-strong -Wsystem-headers -Werror -W=
all -Wno-format-y2k -W -Wno-unused-parameter -Wmissing-prototypes -Wpointer=
-arith -Wreturn-type -Wcast-qual -Wwrite-strings -Wswitch -Wshadow -Wunused=
-parameter -Wcast-align -Wchar-subscripts -Wnested-externs -Wold-style-defi=
nition -Wno-pointer-sign -Wdate-time -Wno-error=3Daddress -Wno-error=3Darra=
y-bounds -Wno-error=3Dattributes -Wno-error=3Dbool-compare -Wno-error=3Dcas=
t-align -Wno-error=3Dclobbered -Wno-error=3Ddeprecated-declarations -Wno-er=
ror=3Denum-compare -Wno-error=3Dextra -Wno-error=3Dlogical-not-parentheses =
-Wno-error=3Dstrict-aliasing -Wno-error=3Duninitialized -Wno-error=3Dunused=
-but-set-variable -Wno-error=3Dunused-function -Wno-error=3Dunused-value -W=
no-error=3Dempty-body -Wno-error=3Dmaybe-uninitialized -Wno-error=3Dnonnull=
-compare -Wno-error=3Dshift-negative-value -Wno-error=3Dtautological-compar=
e -Wno-error=3Dunused-const-variable -Wno-error=3Dbool-operation -Wno-error=
=3Ddeprecated -Wno-error=3Dexpansion-to-defined -Wno-error=3Dformat-overflo=
w -Wno-error=3Dformat-truncation -Wno-error=3Dimplicit-fallthrough -Wno-err=
or=3Dint-in-bool-context -Wno-error=3Dmemset-elt-size -Wno-error=3Dnoexcept=
-type -Wno-error=3Dnonnull -Wno-error=3Dpointer-compare -Wno-error=3Dstring=
op-overflow -Wno-error=3Daggressive-loop-optimizations -Wno-error=3Dcast-fu=
nction-type -Wno-error=3Dcatch-value -Wno-error=3Dmultistatement-macros -Wn=
o-error=3Drestrict -Wno-error=3Dsizeof-pointer-memaccess -Wno-error=3Dstrin=
gop-truncation -Wno-return-type       -c /workspace/src/usr.bin/rctl/rctl.c=
 -o rctl.o
--- all_subdir_usr.sbin ---
--- rsdump.o ---
/usr/local/bin/x86_64-unknown-freebsd13.1-gcc12 --sysroot=3D/tmp/obj/worksp=
ace/src/amd64.amd64/tmp -B/usr/local/x86_64-unknown-freebsd13.1/bin/  -O2 -=
pipe -fno-common -DACPI_DB_APP -DACPI_EXEC_APP -fno-strict-aliasing   -I/wo=
rkspace/src/sys -fPIE -g -MD  -MF.depend.rsdump.o -MTrsdump.o -std=3Dgnu99 =
-Wno-format-zero-length -fstack-protector-strong -Wsystem-headers -Werror -=
Wall -Wno-format-y2k -W -Wno-unused-parameter -Wmissing-prototypes -Wpointe=
r-arith -Wno-uninitialized -Wno-pointer-sign -Wdate-time -Wno-error=3Daddre=
ss -Wno-error=3Darray-bounds -Wno-error=3Dattributes -Wno-error=3Dbool-comp=
are -Wno-error=3Dcast-align -Wno-error=3Dclobbered -Wno-error=3Ddeprecated-=
declarations -Wno-error=3Denum-compare -Wno-error=3Dextra -Wno-error=3Dlogi=
cal-not-parentheses -Wno-error=3Dstrict-aliasing -Wno-error=3Duninitialized=
 -Wno-error=3Dunused-but-set-variable -Wno-error=3Dunused-function -Wno-err=
or=3Dunused-value -Wno-error=3Dempty-body -Wno-error=3Dmaybe-uninitialized =
-Wno-error=3Dnonnull-compare -Wno-error=3Dshift-negative-value -Wno-error=
=3Dtautological-compare -Wno-error=3Dunused-const-variable -Wno-error=3Dboo=
l-operation -Wno-error=3Ddeprecated -Wno-error=3Dexpansion-to-defined -Wno-=
error=3Dformat-overflow -Wno-error=3Dformat-truncation -Wno-error=3Dimplici=
t-fallthrough -Wno-error=3Dint-in-bool-context -Wno-error=3Dmemset-elt-size=
 -Wno-error=3Dnoexcept-type -Wno-error=3Dnonnull -Wno-error=3Dpointer-compa=
re -Wno-error=3Dstringop-overflow -Wno-error=3Daggressive-loop-optimization=
s -Wno-error=3Dcast-function-type -Wno-error=3Dcatch-value -Wno-error=3Dmul=
tistatement-macros -Wno-error=3Drestrict -Wno-error=3Dsizeof-pointer-memacc=
ess -Wno-error=3Dstringop-truncation -Wno-return-type -Wno-address-of-packe=
d-member      -c /workspace/src/sys/contrib/dev/acpica/components/resources=
/rsdump.c -o rsdump.o
--- all_subdir_usr.bin ---
--- rctl.full ---
/usr/local/bin/x86_64-unknown-freebsd13.1-gcc12 --sysroot=3D/tmp/obj/worksp=
ace/src/amd64.amd64/tmp -B/usr/local/x86_64-unknown-freebsd13.1/bin/ -O2 -p=
ipe -fno-common -fPIE -g -std=3Dgnu99 -Wno-format-zero-length -fstack-prote=
ctor-strong -Wsystem-headers -Werror -Wall -Wno-format-y2k -W -Wno-unused-p=
arameter -Wmissing-prototypes -Wpointer-arith -Wreturn-type -Wcast-qual -Ww=
rite-strings -Wswitch -Wshadow -Wunused-parameter -Wcast-align -Wchar-subsc=
ripts -Wnested-externs -Wold-style-definition -Wno-pointer-sign -Wdate-time=
 -Wno-error=3Daddress -Wno-error=3Darray-bounds -Wno-error=3Dattributes -Wn=
o-error=3Dbool-compare -Wno-error=3Dcast-align -Wno-error=3Dclobbered -Wno-=
error=3Ddeprecated-declarations -Wno-error=3Denum-compare -Wno-error=3Dextr=
a -Wno-error=3Dlogical-not-parentheses -Wno-error=3Dstrict-aliasing -Wno-er=
ror=3Duninitialized -Wno-error=3Dunused-but-set-variable -Wno-error=3Dunuse=
d-function -Wno-error=3Dunused-value -Wno-error=3Dempty-body -Wno-error=3Dm=
aybe-uninitialized -Wno-error=3Dnonnull-compare -Wno-error=3Dshift-negative=
-value -Wno-error=3Dtautological-compare -Wno-error=3Dunused-const-variable=
 -Wno-error=3Dbool-operation -Wno-error=3Ddeprecated -Wno-error=3Dexpansion=
-to-defined -Wno-error=3Dformat-overflow -Wno-error=3Dformat-truncation -Wn=
o-error=3Dimplicit-fallthrough -Wno-error=3Dint-in-bool-context -Wno-error=
=3Dmemset-elt-size -Wno-error=3Dnoexcept-type -Wno-error=3Dnonnull -Wno-err=
or=3Dpointer-compare -Wno-error=3Dstringop-overflow -Wno-error=3Daggressive=
-loop-optimizations -Wno-error=3Dcast-function-type -Wno-error=3Dcatch-valu=
e -Wno-error=3Dmultistatement-macros -Wno-error=3Drestrict -Wno-error=3Dsiz=
eof-pointer-memaccess -Wno-error=3Dstringop-truncation -Wno-return-type  -W=
l,-zrelro -pie   -o rctl.full rctl.o   -lutil=20
--- all_subdir_lib ---
--- utils_test.full ---
/usr/local/bin/x86_64-unknown-freebsd13.1-gcc12 --sysroot=3D/tmp/obj/worksp=
ace/src/amd64.amd64/tmp -B/usr/local/x86_64-unknown-freebsd13.1/bin/ -O2 -p=
ipe -fno-common -DHAVE_CONFIG_H -DATF_BUILD_CC=3D'"cc"' -DATF_BUILD_CFLAGS=
=3D'"-Wall"' -DATF_BUILD_CPP=3D'"cpp"' -DATF_BUILD_CPPFLAGS=3D'""' -DATF_BU=
ILD_CXX=3D'"c++"' -DATF_BUILD_CXXFLAGS=3D'"-Wall"' -DATF_INCLUDEDIR=3D'"/us=
r/include"' -I/workspace/src/contrib/atf -DHAVE_CONFIG_H -DATF_BUILD_CC=3D'=
"cc"' -DATF_BUILD_CFLAGS=3D'"-Wall"' -DATF_BUILD_CPP=3D'"cpp"' -DATF_BUILD_=
CPPFLAGS=3D'""' -DATF_BUILD_CXX=3D'"c++"' -DATF_BUILD_CXXFLAGS=3D'"-Wall"' =
-fPIE -g -std=3Dgnu99 -Wno-format-zero-length -fstack-protector-strong -Wsy=
stem-headers -Werror -Wall -Wno-format-y2k -W -Wno-unused-parameter -Wmissi=
ng-prototypes -Wpointer-arith -Wno-uninitialized -Wno-pointer-sign -Wdate-t=
ime -Wno-error=3Daddress -Wno-error=3Darray-bounds -Wno-error=3Dattributes =
-Wno-error=3Dbool-compare -Wno-error=3Dcast-align -Wno-error=3Dclobbered -W=
no-error=3Ddeprecated-declarations -Wno-error=3Denum-compare -Wno-error=3De=
xtra -Wno-error=3Dlogical-not-parentheses -Wno-error=3Dstrict-aliasing -Wno=
-error=3Duninitialized -Wno-error=3Dunused-but-set-variable -Wno-error=3Dun=
used-function -Wno-error=3Dunused-value -Wno-error=3Dempty-body -Wno-error=
=3Dmaybe-uninitialized -Wno-error=3Dnonnull-compare -Wno-error=3Dshift-nega=
tive-value -Wno-error=3Dtautological-compare -Wno-error=3Dunused-const-vari=
able -Wno-error=3Dbool-operation -Wno-error=3Ddeprecated -Wno-error=3Dexpan=
sion-to-defined -Wno-error=3Dformat-overflow -Wno-error=3Dformat-truncation=
 -Wno-error=3Dimplicit-fallthrough -Wno-error=3Dint-in-bool-context -Wno-er=
ror=3Dmemset-elt-size -Wno-error=3Dnoexcept-type -Wno-error=3Dnonnull -Wno-=
error=3Dpointer-compare -Wno-error=3Dstringop-overflow -Wno-error=3Daggress=
ive-loop-optimizations -Wno-error=3Dcast-function-type -Wno-error=3Dcatch-v=
alue -Wno-error=3Dmultistatement-macros -Wno-error=3Drestrict -Wno-error=3D=
sizeof-pointer-memaccess -Wno-error=3Dstringop-truncation -Wno-return-type =
-Wno-address-of-packed-member  -Wl,-zrelro -pie  -o utils_test.full utils_t=
est.o test_helpers.o  -lprivateatf-c
--- all_subdir_usr.bin ---
--- rctl.8.gz ---
gzip -cn /workspace/src/usr.bin/rctl/rctl.8 > rctl.8.gz
--- rctl.debug ---
/usr/local/x86_64-unknown-freebsd13.1/bin/objcopy --only-keep-debug rctl.fu=
ll rctl.debug
--- all_subdir_lib ---
--- utils_test.debug ---
/usr/local/x86_64-unknown-freebsd13.1/bin/objcopy --only-keep-debug utils_t=
est.full utils_test.debug
--- all_subdir_usr.bin ---
--- rctl ---
/usr/local/x86_64-unknown-freebsd13.1/bin/objcopy --strip-debug --add-gnu-d=
ebuglink=3Drctl.debug  rctl.full rctl
--- all_subdir_lib ---
--- utils_test ---
/usr/local/x86_64-unknown-freebsd13.1/bin/objcopy --strip-debug --add-gnu-d=
ebuglink=3Dutils_test.debug  utils_test.full utils_test
--- all_subdir_usr.bin ---
--- all_subdir_usr.bin/renice ---
=3D=3D=3D> usr.bin/renice (all)
--- all_subdir_lib ---
--- all_subdir_lib/atf/libatf-c++ ---
=3D=3D=3D> lib/atf/libatf-c++ (all)
--- all_subdir_usr.bin ---
--- .depend ---
echo renice.full: /tmp/obj/workspace/src/amd64.amd64/tmp/usr/lib/libc.a  >>=
 .depend
--- renice.o ---
/usr/local/bin/x86_64-unknown-freebsd13.1-gcc12 --sysroot=3D/tmp/obj/worksp=
ace/src/amd64.amd64/tmp -B/usr/local/x86_64-unknown-freebsd13.1/bin/  -O2 -=
pipe -fno-common   -fPIE -g -MD  -MF.depend.renice.o -MTrenice.o -std=3Dgnu=
99 -Wno-format-zero-length -fstack-protector-strong -Wsystem-headers -Werro=
r -Wall -Wno-format-y2k -W -Wno-unused-parameter -Wmissing-prototypes -Wpoi=
nter-arith -Wreturn-type -Wcast-qual -Wwrite-strings -Wswitch -Wshadow -Wun=
used-parameter -Wcast-align -Wchar-subscripts -Wnested-externs -Wold-style-=
definition -Wno-pointer-sign -Wdate-time -Wno-error=3Daddress -Wno-error=3D=
array-bounds -Wno-error=3Dattributes -Wno-error=3Dbool-compare -Wno-error=
=3Dcast-align -Wno-error=3Dclobbered -Wno-error=3Ddeprecated-declarations -=
Wno-error=3Denum-compare -Wno-error=3Dextra -Wno-error=3Dlogical-not-parent=
heses -Wno-error=3Dstrict-aliasing -Wno-error=3Duninitialized -Wno-error=3D=
unused-but-set-variable -Wno-error=3Dunused-function -Wno-error=3Dunused-va=
lue -Wno-error=3Dempty-body -Wno-error=3Dmaybe-uninitialized -Wno-error=3Dn=
onnull-compare -Wno-error=3Dshift-negative-value -Wno-error=3Dtautological-=
compare -Wno-error=3Dunused-const-variable -Wno-error=3Dbool-operation -Wno=
-error=3Ddeprecated -Wno-error=3Dexpansion-to-defined -Wno-error=3Dformat-o=
verflow -Wno-error=3Dformat-truncation -Wno-error=3Dimplicit-fallthrough -W=
no-error=3Dint-in-bool-context -Wno-error=3Dmemset-elt-size -Wno-error=3Dno=
except-type -Wno-error=3Dnonnull -Wno-error=3Dpointer-compare -Wno-error=3D=
stringop-overflow -Wno-error=3Daggressive-loop-optimizations -Wno-error=3Dc=
ast-function-type -Wno-error=3Dcatch-value -Wno-error=3Dmultistatement-macr=
os -Wno-error=3Drestrict -Wno-error=3Dsizeof-pointer-memaccess -Wno-error=
=3Dstringop-truncation -Wno-return-type       -c /workspace/src/usr.bin/ren=
ice/renice.c -o renice.o
/workspace/src/usr.bin/renice/renice.c:33:19: warning: 'copyright' defined =
but not used [-Wunused-const-variable=3D]
   33 | static const char copyright[] =3D
      |                   ^~~~~~~~~
--- all_subdir_lib ---
--- all_subdir_lib/atf/libatf-c++/tests ---
=3D=3D=3D> lib/atf/libatf-c++/tests (all)
--- all_subdir_usr.sbin ---
--- rsdumpinfo.o ---
/usr/local/bin/x86_64-unknown-freebsd13.1-gcc12 --sysroot=3D/tmp/obj/worksp=
ace/src/amd64.amd64/tmp -B/usr/local/x86_64-unknown-freebsd13.1/bin/  -O2 -=
pipe -fno-common -DACPI_DB_APP -DACPI_EXEC_APP -fno-strict-aliasing   -I/wo=
rkspace/src/sys -fPIE -g -MD  -MF.depend.rsdumpinfo.o -MTrsdumpinfo.o -std=
=3Dgnu99 -Wno-format-zero-length -fstack-protector-strong -Wsystem-headers =
-Werror -Wall -Wno-format-y2k -W -Wno-unused-parameter -Wmissing-prototypes=
 -Wpointer-arith -Wno-uninitialized -Wno-pointer-sign -Wdate-time -Wno-erro=
r=3Daddress -Wno-error=3Darray-bounds -Wno-error=3Dattributes -Wno-error=3D=
bool-compare -Wno-error=3Dcast-align -Wno-error=3Dclobbered -Wno-error=3Dde=
precated-declarations -Wno-error=3Denum-compare -Wno-error=3Dextra -Wno-err=
or=3Dlogical-not-parentheses -Wno-error=3Dstrict-aliasing -Wno-error=3Dunin=
itialized -Wno-error=3Dunused-but-set-variable -Wno-error=3Dunused-function=
 -Wno-error=3Dunused-value -Wno-error=3Dempty-body -Wno-error=3Dmaybe-unini=
tialized -Wno-error=3Dnonnull-compare -Wno-error=3Dshift-negative-value -Wn=
o-error=3Dtautological-compare -Wno-error=3Dunused-const-variable -Wno-erro=
r=3Dbool-operation -Wno-error=3Ddeprecated -Wno-error=3Dexpansion-to-define=
d -Wno-error=3Dformat-overflow -Wno-error=3Dformat-truncation -Wno-error=3D=
implicit-fallthrough -Wno-error=3Dint-in-bool-context -Wno-error=3Dmemset-e=
lt-size -Wno-error=3Dnoexcept-type -Wno-error=3Dnonnull -Wno-error=3Dpointe=
r-compare -Wno-error=3Dstringop-overflow -Wno-error=3Daggressive-loop-optim=
izations -Wno-error=3Dcast-function-type -Wno-error=3Dcatch-value -Wno-erro=
r=3Dmultistatement-macros -Wno-error=3Drestrict -Wno-error=3Dsizeof-pointer=
-memaccess -Wno-error=3Dstringop-truncation -Wno-return-type -Wno-address-o=
f-packed-member      -c /workspace/src/sys/contrib/dev/acpica/components/re=
sources/rsdumpinfo.c -o rsdumpinfo.o
--- all_subdir_lib ---
--- all_subdir_lib/atf/libatf-c++/tests/detail ---
=3D=3D=3D> lib/atf/libatf-c++/tests/detail (all)
--- test_helpers.o ---
/usr/local/bin/x86_64-unknown-freebsd13.1-g++12  --sysroot=3D/tmp/obj/works=
pace/src/amd64.amd64/tmp -B/usr/local/x86_64-unknown-freebsd13.1/bin/  -O2 =
-pipe -fno-common -DHAVE_CONFIG_H -DATF_C_TESTS_BASE=3D'"/usr/tests/lib/atf=
/libatf-c"' -DATF_INCLUDEDIR=3D'"/usr/include"' -I/workspace/src/contrib/at=
f -fPIE -g -Wno-format-zero-length -fstack-protector-strong -Wsystem-header=
s -Werror -Wall -Wno-format-y2k -W -Wno-unused-parameter -Wpointer-arith -W=
no-uninitialized -Wdate-time -Wno-error=3Daddress -Wno-error=3Darray-bounds=
 -Wno-error=3Dattributes -Wno-error=3Dbool-compare -Wno-error=3Dcast-align =
-Wno-error=3Dclobbered -Wno-error=3Ddeprecated-declarations -Wno-error=3Den=
um-compare -Wno-error=3Dextra -Wno-error=3Dlogical-not-parentheses -Wno-err=
or=3Dstrict-aliasing -Wno-error=3Duninitialized -Wno-error=3Dunused-but-set=
-variable -Wno-error=3Dunused-function -Wno-error=3Dunused-value -Wno-error=
=3Dempty-body -Wno-error=3Dmaybe-uninitialized -Wno-error=3Dnonnull-compare=
 -Wno-error=3Dshift-negative-value -Wno-error=3Dtautological-compare -Wno-e=
rror=3Dunused-const-variable -Wno-error=3Dbool-operation -Wno-error=3Ddepre=
cated -Wno-error=3Dexpansion-to-defined -Wno-error=3Dformat-overflow -Wno-e=
rror=3Dformat-truncation -Wno-error=3Dimplicit-fallthrough -Wno-error=3Dint=
-in-bool-context -Wno-error=3Dmemset-elt-size -Wno-error=3Dnoexcept-type -W=
no-error=3Dnonnull -Wno-error=3Dpointer-compare -Wno-error=3Dstringop-overf=
low -Wno-error=3Daggressive-loop-optimizations -Wno-error=3Dcast-function-t=
ype -Wno-error=3Dcatch-value -Wno-error=3Dmultistatement-macros -Wno-error=
=3Drestrict -Wno-error=3Dsizeof-pointer-memaccess -Wno-error=3Dstringop-tru=
ncation -Wno-return-type -Wno-address-of-packed-member  -fPIE -std=3Dc++11 =
-Wno-deprecated-declarations -Wno-literal-suffix -Wno-error=3Dunknown-pragm=
as      -c /workspace/src/contrib/atf/atf-c++/detail/test_helpers.cpp -o te=
st_helpers.o
--- all_subdir_lib/googletest ---
--- googletest-port-test ---
--- googletest-port-test ---
--- all_subdir_usr.bin ---
--- all_subdir_usr.bin/renice/tests ---
=3D=3D=3D> usr.bin/renice/tests (all)
--- renice_test ---
echo '#! /usr/libexec/atf-sh' > renice_test.tmp
cat /workspace/src/usr.bin/renice/tests/renice_test.sh >>renice_test.tmp
chmod +x renice_test.tmp
mv renice_test.tmp renice_test
--- Kyuafile ---
--- renice.full ---
--- all_subdir_lib ---
/usr/local/bin/x86_64-unknown-freebsd13.1-g++12 --sysroot=3D/tmp/obj/worksp=
ace/src/amd64.amd64/tmp -B/usr/local/x86_64-unknown-freebsd13.1/bin/ -O2 -p=
ipe -fno-common -fPIE -Wno-format-zero-length -fstack-protector-strong -Wsy=
stem-headers -Wall -Wno-format-y2k -W -Wno-unused-parameter -Wpointer-arith=
 -Wreturn-type -Wcast-qual -Wwrite-strings -Wswitch -Wshadow -Wunused-param=
eter -Wcast-align -Wchar-subscripts -Wdate-time -Wno-error=3Daddress -Wno-e=
rror=3Darray-bounds -Wno-error=3Dattributes -Wno-error=3Dbool-compare -Wno-=
error=3Dcast-align -Wno-error=3Dclobbered -Wno-error=3Ddeprecated-declarati=
ons -Wno-error=3Denum-compare -Wno-error=3Dextra -Wno-error=3Dlogical-not-p=
arentheses -Wno-error=3Dstrict-aliasing -Wno-error=3Duninitialized -Wno-err=
or=3Dunused-but-set-variable -Wno-error=3Dunused-function -Wno-error=3Dunus=
ed-value -Wno-error=3Dempty-body -Wno-error=3Dmaybe-uninitialized -Wno-erro=
r=3Dnonnull-compare -Wno-error=3Dshift-negative-value -Wno-error=3Dtautolog=
ical-compare -Wno-error=3Dunused-const-variable -Wno-error=3Dbool-operation=
 -Wno-error=3Ddeprecat--- all_subdir_usr.bin ---
/usr/local/bin/x86_64-unknown-freebsd13.1-gcc12 --sysroot=3D/tmp/obj/worksp=
ace/src/amd64.amd64/tmp -B/usr/local/x86_64-unknown-freebsd13.1/bin/ -O2 -p=
ipe -fno-common -fPIE -g -std=3Dgnu99 -Wno-format-zero-length -fstack-prote=
ctor-strong -Wsystem-headers -Werror -Wall -Wno-format-y2k -W -Wno-unused-p=
arameter -Wmissing-prototypes -Wpointer-arith -Wreturn-type -Wcast-qual -Ww=
rite-strings -Wswitch -Wshadow -Wunused-parameter -Wcast-align -Wchar-subsc=
ripts -Wnested-externs -Wold-style-definition -Wno-pointer-sign -Wdate-time=
 -Wno-error=3Daddress -Wno-error=3Darray-bounds -Wno-error=3Dattributes -Wn=
o-error=3Dbool-compare -Wno-error=3Dcast-align -Wno-error=3Dclobbered -Wno-=
error=3Ddeprecated-declarations -Wno-error=3Denum-compare -Wno-error=3Dextr=
a -Wno-error=3Dlogical-not-parentheses -Wno-error=3Dstrict-aliasing -Wno-er=
ror=3Duninitialized -Wno-error=3Dunused-but-set-variable -Wno-error=3Dunuse=
d-function -Wno-error=3Dunused-value -Wno-error=3Dempty-body -Wno-error=3Dm=
aybe-uninitialized -Wno-error=3Dnonnull-compare -Wno-error=3Dshift-negative=
-value -Wno-erro--- all_subdir_lib ---
ed -Wno-error=3Dexpansion-to-defined -Wno-error=3Dformat-overflow -Wno-erro=
r=3Dformat-truncation -Wno-error=3Dimplicit-fallthrough -Wno-error=3Dint-in=
-bool-context -Wno-error=3Dmemset-elt-size -Wno-error=3Dnoexcept-type -Wno-=
error=3Dnonnull -Wno-error=3Dpointer-compare -Wno-error=3Dstringop-overflow=
 -Wno-error=3Daggressive-loop-optimizations -Wno-error=3Dcast-function-type=
 -Wno-error=3Dcatch-value -Wno-error=3Dmultistatement-macros -Wno-error=3Dr=
estrict -Wno-error=3Dsizeof-pointer-memaccess -Wno-error=3Dstringop-truncat=
ion -Wno-return-type -I/tmp/obj/workspace/src/amd64.amd64/tmp/usr/include/p=
rivate -I/workspace/src/contrib/googletest/googletest/include -I/workspace/=
src/contrib/googletest/googletest -I/tmp/obj/workspace/src/amd64.amd64/tmp/=
usr/include/private -DGTEST_HAS_POSIX_RE=3D1 -DGTEST_HAS_PTHREAD=3D1 -DGTES=
T_HAS_STREAM_REDIRECTION=3D1 -frtti -DGTEST_HAS_POSIX_RE=3D1 -DGTEST_HAS_PT=
HREAD=3D1 -DGTEST_HAS_STREAM_REDIRECTION=3D1 -frtti -fPIE -std=3Dc++11 -Wno=
-deprecated-copy -Wno-literal-suffix -Wno-error=3Dunknown-pragmas  -Wl,-zre=
lro -pie  -o googletest---- all_subdir_usr.bin ---
r=3Dtautological-compare -Wno-error=3Dunused-const-variable -Wno-error=3Dbo=
ol-operation -Wno-error=3Ddeprecated -Wno-error=3Dexpansion-to-defined -Wno=
-error=3Dformat-overflow -Wno-error=3Dformat-truncation -Wno-error=3Dimplic=
it-fallthrough -Wno-error=3Dint-in-bool-context -Wno-error=3Dmemset-elt-siz=
e -Wno-error=3Dnoexcept-type -Wno-error=3Dnonnull -Wno-error=3Dpointer-comp=
are -Wno-error=3Dstringop-overflow -Wno-error=3Daggressive-loop-optimizatio=
ns -Wno-error=3Dcast-function-type -Wno-error=3Dcatch-value -Wno-error=3Dmu=
ltistatement-macros -Wno-error=3Drestrict -Wno-error=3Dsizeof-pointer-memac=
cess -Wno-error=3Dstringop-truncation -Wno-return-type  -Wl,-zrelro -pie   =
-o renice.full renice.o =20
--- all_subdir_lib ---
port-test  googletest-port-test.o -lprivategtest -lprivategtest_main -lpriv=
ategtest  -lpthread
--- all_subdir_usr.sbin ---
--- rsinfo.o ---
/usr/local/bin/x86_64-unknown-freebsd13.1-gcc12 --sysroot=3D/tmp/obj/worksp=
ace/src/amd64.amd64/tmp -B/usr/local/x86_64-unknown-freebsd13.1/bin/  -O2 -=
pipe -fno-common -DACPI_DB_APP -DACPI_EXEC_APP -fno-strict-aliasing   -I/wo=
rkspace/src/sys -fPIE -g -MD  -MF.depend.rsinfo.o -MTrsinfo.o -std=3Dgnu99 =
-Wno-format-zero-length -fstack-protector-strong -Wsystem-headers -Werror -=
Wall -Wno-format-y2k -W -Wno-unused-parameter -Wmissing-prototypes -Wpointe=
r-arith -Wno-uninitialized -Wno-pointer-sign -Wdate-time -Wno-error=3Daddre=
ss -Wno-error=3Darray-bounds -Wno-error=3Dattributes -Wno-error=3Dbool-comp=
are -Wno-error=3Dcast-align -Wno-error=3Dclobbered -Wno-error=3Ddeprecated-=
declarations -Wno-error=3Denum-compare -Wno-error=3Dextra -Wno-error=3Dlogi=
cal-not-parentheses -Wno-error=3Dstrict-aliasing -Wno-error=3Duninitialized=
 -Wno-error=3Dunused-but-set-variable -Wno-error=3Dunused-function -Wno-err=
or=3Dunused-value -Wno-error=3Dempty-body -Wno-error=3Dmaybe-uninitialized =
-Wno-error=3Dnonnull-compare -Wno-error=3Dshift-negative-value -Wno-error=
=3Dtautological-compare -Wno-error=3Dunused-const-variable -Wno-error=3Dboo=
l-operation -Wno-error=3Ddeprecated -Wno-error=3Dexpansion-to-defined -Wno-=
error=3Dformat-overflow -Wno-error=3Dformat-truncation -Wno-error=3Dimplici=
t-fallthrough -Wno-error=3Dint-in-bool-context -Wno-error=3Dmemset-elt-size=
 -Wno-error=3Dnoexcept-type -Wno-error=3Dnonnull -Wno-error=3Dpointer-compa=
re -Wno-error=3Dstringop-overflow -Wno-error=3Daggressive-loop-optimization=
s -Wno-error=3Dcast-function-type -Wno-error=3Dcatch-value -Wno-error=3Dmul=
tistatement-macros -Wno-error=3Drestrict -Wno-error=3Dsizeof-pointer-memacc=
ess -Wno-error=3Dstringop-truncation -Wno-return-type -Wno-address-of-packe=
d-member      -c /workspace/src/sys/contrib/dev/acpica/components/resources=
/rsinfo.c -o rsinfo.o
--- all_subdir_usr.bin ---
--- renice.8.gz ---
gzip -cn /workspace/src/usr.bin/renice/renice.8 > renice.8.gz
--- renice.debug ---
/usr/local/x86_64-unknown-freebsd13.1/bin/objcopy --only-keep-debug renice.=
full renice.debug
--- renice ---
/usr/local/x86_64-unknown-freebsd13.1/bin/objcopy --strip-debug --add-gnu-d=
ebuglink=3Drenice.debug  renice.full renice
--- all_subdir_usr.bin/resizewin ---
=3D=3D=3D> usr.bin/resizewin (all)
--- all_subdir_usr.sbin ---
--- all_subdir_usr.sbin/bhyve ---
--- all_subdir_usr.sbin/bhyve/kbdlayout ---
=3D=3D=3D> usr.sbin/bhyve/kbdlayout (all)
--- all_subdir_usr.sbin/acpi ---
--- rsio.o ---
--- all_subdir_usr.bin ---
--- .depend ---
--- all_subdir_usr.sbin ---
/usr/local/bin/x86_64-unknown-freebsd13.1-gcc12 --sysroot=3D/tmp/obj/worksp=
ace/src/amd64.amd64/tmp -B/usr/local/x86_64-unknown-freebsd13.1/bin/  -O2 -=
pipe -fno-common -DACPI_DB_APP -DACPI_EXEC_APP -fno-strict-aliasing   -I/wo=
rkspace/src/sys -fPIE -g -MD  -MF.depend.rsio.o -MTrsio.o -std=3Dgnu99 -Wno=
-format-zero-length -fstack-protector-strong -Wsystem-headers -Werror -Wall=
 -Wno-format-y2k -W -Wno-unused-parameter -Wmissing-prototypes -Wpointer-ar=
ith -Wno-uninitialized -Wno-pointer-sign -Wdate-time -Wno-error=3Daddress -=
Wno-error=3Darray-bounds -Wno-error=3Dattributes -Wno-error=3Dbool-compare =
-Wno-error=3Dcast-align -Wno-error=3Dclobbered -Wno-error=3Ddeprecated-decl=
arations -Wno-error=3Denum-compare -Wno-error=3Dextra -Wno-error=3Dlogical-=
not-parentheses -Wno-error=3Dstrict-aliasing -Wno-error=3Duninitialized -Wn=
o-error=3Dunused-but-set-variable -Wno-error=3Dunused-function -Wno-error=
=3Dunused-value -Wno-error=3Dempty-body -Wno-error=3Dmaybe-uninitialized -W=
no-error=3Dnonnull-compare -Wno-error=3Dshift-negative-value -Wno-error=3Dt=
autological-compare -Wno-error=3Dunused-const-variable -Wno-error=3Dbool-op=
eration -Wno-error=3Ddeprecated -Wno-error=3Dexpansion-to-defined -Wno-erro=
r=3Dformat-overflow -Wno-error=3Dformat-truncation -Wno-error=3Dimplicit-fa=
llthrough -Wno-error=3Dint-in-bool-context -Wno-error=3Dmemset-elt-size -Wn=
o-error=3Dnoexcept-type -Wno-error=3Dnonnull -Wno-error=3Dpointer-compare -=
Wno-error=3Dstringop-overflow -Wno-error=3Daggressive-loop-optimizations -W=
no-error=3Dcast-function-type -Wno-error=3Dcatch-value -Wno-error=3Dmultist=
atement-macros -Wno-error=3Drestrict -Wno-error=3Dsizeof-pointer-memaccess =
-Wno-error=3Dstringop-truncation -Wno-return-type -Wno-address-of-packed-me=
mber      -c /workspace/src/sys/contrib/dev/acpica/components/resources/rsi=
o.c -o rsio.o
--- all_subdir_usr.bin ---
echo resizewin.full: /tmp/obj/workspace/src/amd64.amd64/tmp/usr/lib/libc.a =
 >> .depend
--- resizewin.o ---
/usr/local/bin/x86_64-unknown-freebsd13.1-gcc12 --sysroot=3D/tmp/obj/worksp=
ace/src/amd64.amd64/tmp -B/usr/local/x86_64-unknown-freebsd13.1/bin/  -O2 -=
pipe -fno-common   -fPIE -g -MD  -MF.depend.resizewin.o -MTresizewin.o -std=
=3Dgnu99 -Wno-format-zero-length -fstack-protector-strong -Wsystem-headers =
-Werror -Wall -Wno-format-y2k -W -Wno-unused-parameter -Wmissing-prototypes=
 -Wpointer-arith -Wreturn-type -Wcast-qual -Wwrite-strings -Wswitch -Wshado=
w -Wunused-parameter -Wcast-align -Wchar-subscripts -Wnested-externs -Wold-=
style-definition -Wno-pointer-sign -Wdate-time -Wno-error=3Daddress -Wno-er=
ror=3Darray-bounds -Wno-error=3Dattributes -Wno-error=3Dbool-compare -Wno-e=
rror=3Dcast-align -Wno-error=3Dclobbered -Wno-error=3Ddeprecated-declaratio=
ns -Wno-error=3Denum-compare -Wno-error=3Dextra -Wno-error=3Dlogical-not-pa=
rentheses -Wno-error=3Dstrict-aliasing -Wno-error=3Duninitialized -Wno-erro=
r=3Dunused-but-set-variable -Wno-error=3Dunused-function -Wno-error=3Dunuse=
d-value -Wno-error=3Dempty-body -Wno-error=3Dmaybe-uninitialized -Wno-error=
=3Dnonnull-compare -Wno-error=3Dshift-negative-value -Wno-error=3Dtautologi=
cal-compare -Wno-error=3Dunused-const-variable -Wno-error=3Dbool-operation =
-Wno-error=3Ddeprecated -Wno-error=3Dexpansion-to-defined -Wno-error=3Dform=
at-overflow -Wno-error=3Dformat-truncation -Wno-error=3Dimplicit-fallthroug=
h -Wno-error=3Dint-in-bool-context -Wno-error=3Dmemset-elt-size -Wno-error=
=3Dnoexcept-type -Wno-error=3Dnonnull -Wno-error=3Dpointer-compare -Wno-err=
or=3Dstringop-overflow -Wno-error=3Daggressive-loop-optimizations -Wno-erro=
r=3Dcast-function-type -Wno-error=3Dcatch-value -Wno-error=3Dmultistatement=
-macros -Wno-error=3Drestrict -Wno-error=3Dsizeof-pointer-memaccess -Wno-er=
ror=3Dstringop-truncation -Wno-return-type       -c /workspace/src/usr.bin/=
resizewin/resizewin.c -o resizewin.o
--- all_subdir_usr.sbin ---
--- all_subdir_usr.sbin/bhyve ---
--- bhyve.full ---
/usr/local/bin/x86_64-unknown-freebsd13.1-gcc12 --sysroot=3D/tmp/obj/worksp=
ace/src/amd64.amd64/tmp -B/usr/local/x86_64-unknown-freebsd13.1/bin/ -O2 -p=
ipe -fno-common -I/workspace/src/usr.sbin/bhyve/../../contrib/lib9p -I/work=
space/src/sys -DINET -DINET6 -DNETGRAPH -I/workspace/src/sys/dev/e1000 -I/w=
orkspace/src/sys/dev/mii -I/workspace/src/sys/dev/usb/controller -fPIE -g -=
std=3Dgnu99 -Wno-format-zero-length -fstack-protector-strong -Wsystem-heade=
rs -Werror -Wall -Wno-format-y2k -W -Wno-unused-parameter -Wmissing-prototy=
pes -Wpointer-arith -Wreturn-type -Wcast-qual -Wwrite-strings -Wswitch -Wsh=
adow -Wunused-parameter -Wchar-subscripts -Wnested-externs -Wold-style-defi=
nition -Wno-pointer-sign -Wdate-time -Wno-error=3Daddress -Wno-error=3Darra=
y-bounds -Wno-error=3Dattributes -Wno-error=3Dbool-compare -Wno-error=3Dcas=
t-align -Wno-error=3Dclobbered -Wno-error=3Ddeprecated-declarations -Wno-er=
ror=3Denum-compare -Wno-error=3Dextra -Wno-error=3Dlogical-not-parentheses =
-Wno-error=3Dstrict-aliasing -Wno-error=3Duninitialized -Wno-error=3Dunused=
-but-set-variable -Wno-error=3Dunused-function -Wno-error=3Dunused-value -W=
no-error=3Dempty-body -Wno-error=3Dmaybe-uninitialized -Wno-error=3Dnonnull=
-compare -Wno-error=3Dshift-negative-value -Wno-error=3Dtautological-compar=
e -Wno-error=3Dunused-const-variable -Wno-error=3Dbool-operation -Wno-error=
=3Ddeprecated -Wno-error=3Dexpansion-to-defined -Wno-error=3Dformat-overflo=
w -Wno-error=3Dformat-truncation -Wno-error=3Dimplicit-fallthrough -Wno-err=
or=3Dint-in-bool-context -Wno-error=3Dmemset-elt-size -Wno-error=3Dnoexcept=
-type -Wno-error=3Dnonnull -Wno-error=3Dpointer-compare -Wno-error=3Dstring=
op-overflow -Wno-error=3Daggressive-loop-optimizations -Wno-error=3Dcast-fu=
nction-type -Wno-error=3Dcatch-value -Wno-error=3Dmultistatement-macros -Wn=
o-error=3Drestrict -Wno-error=3Dsizeof-pointer-memaccess -Wno-error=3Dstrin=
gop-truncation -Wno-return-type  -Wl,-zrelro -pie   -o bhyve.full acpi_devi=
ce.o atkbdc.o acpi.o audio.o basl.o bhyvegc.o bhyverun.o block_if.o bootrom=
.o config.o console.o ctl_util.o ctl_scsi_all.o fwctl.o gdb.o hda_codec.o i=
nout.o ioapic.o kernemu_dev.o mem.o mevent.o mptbl.o net_backends.o net_uti=
ls.o pci_ahci.o pci_e82545.o pci_emul.o pci_hda.o pci_fbuf.o pci_hostbridge=
.o pci_irq.o pci_lpc.o pci_nvme.o pci_passthru.o pci_virtio_9p.o pci_virtio=
_block.o pci_virtio_console.o pci_virtio_input.o pci_virtio_net.o pci_virti=
o_rnd.o pci_virtio_scsi.o pci_uart.o pci_xhci.o pctestdev.o pm.o post.o ps2=
kbd.o ps2mouse.o rfb.o rtc.o smbiostbl.o sockstream.o task_switch.o uart_em=
ul.o usb_emul.o usb_mouse.o virtio.o vga.o vmgenc.o xmsr.o spinup_ap.o iov.=
o vmm_instruction_emul.o   -lvmmapi  -lmd  -lnv   -lz  -lutil  -lsbuf  -lca=
m  -l9p  -lnetgraph  -lcrypto -lpthread=20
--- bhyve.8.gz ---
gzip -cn /workspace/src/usr.sbin/bhyve/bhyve.8 > bhyve.8.gz
--- all_subdir_lib ---
--- all_subdir_lib/atf ---
--- libprivateatf-c++.so.2.full ---
building shared library libprivateatf-c++.so.2
/usr/local/bin/x86_64-unknown-freebsd13.1-g++12 --sysroot=3D/tmp/obj/worksp=
ace/src/amd64.amd64/tmp -B/usr/local/x86_64-unknown-freebsd13.1/bin/  -L/tm=
p/obj/workspace/src/amd64.amd64/lib/atf/libatf-c -Wl,-zrelro   -fstack-prot=
ector-strong -shared -Wl,-x -Wl,--fatal-warnings -Wl,--warn-shared-textrel =
 -o libprivateatf-c++.so.2.full -Wl,-soname,libprivateatf-c++.so.2 applicat=
ion.pico build.pico check.pico env.pico exceptions.pico fs.pico process.pic=
o tests.pico text.pico utils.pico -lprivateatf-c=20
--- all_subdir_usr.sbin ---
--- all_subdir_usr.sbin/acpi ---
--- rsirq.o ---
--- all_subdir_usr.sbin/bhyve ---
--- bhyve.full ---
/usr/local/bin/x86_64-unknown-freebsd13.1-ld: warning: libcap_pwd.so.1, nee=
ded by /tmp/obj/workspace/src/amd64.amd64/tmp/usr/lib/lib9p.so, not found (=
try using -rpath or -rpath-link)
--- all_subdir_usr.sbin/acpi ---
/usr/local/bin/x86_64-unknown-freebsd13.1-gcc12 --sysroot=3D/tmp/obj/worksp=
ace/src/amd64.amd64/tmp -B/usr/local/x86_64-unknown-freebsd13.1/bin/  -O2 -=
pipe -fno-common -DACPI_DB_APP -DACPI_EXEC_APP -fno-strict-aliasing   -I/wo=
rkspace/src/sys -fPIE -g -MD  -MF.depend.rsirq.o -MTrsirq.o -std=3Dgnu99 -W=
no-format-zero-length -fstack-protector-strong -Wsystem-headers -Werror -Wa=
ll -Wno-format-y2k -W -Wno-unused-parameter -Wmissing-prototypes -Wpointer-=
arith -Wno-uninitialized -Wno-pointer-sign -Wdate-time -Wno-error=3Daddress=
 -Wno-error=3Darray-bounds -Wno-error=3Dattributes -Wno-error=3Dbool-compar=
e -Wno-error=3Dcast-align -Wno-error=3Dclobbered -Wno-error=3Ddeprecated-de=
clarations -Wno-error=3Denum-compare -Wno-error=3Dextra -Wno-error=3Dlogica=
l-not-parentheses -Wno-error=3Dstrict-aliasing -Wno-error=3Duninitialized -=
Wno-error=3Dunused-but-set-variable -Wno-error=3Dunused-function -Wno-error=
=3Dunused-value -Wno-error=3Dempty-body -Wno-error=3Dmaybe-uninitialized -W=
no-error=3Dnonnull-compare -Wno-error=3Dshift-negative-value -Wno-error=3Dt=
autological-compare -Wno-error=3Dunused-const-variable -Wno-error=3Dbool-op=
eration -Wno-error=3Ddeprecated -Wno-error=3Dexpansion-to-defined -Wno-erro=
r=3Dformat-overflow -Wno-error=3Dformat-truncation -Wno-error=3Dimplicit-fa=
llthrough -Wno-error=3Dint-in-bool-context -Wno-error=3Dmemset-elt-size -Wn=
o-error=3Dnoexcept-type -Wno-error=3Dnonnull -Wno-error=3Dpointer-compare -=
Wno-error=3Dstringop-overflow -Wno-error=3Daggressive-loop-optimizations -W=
no-error=3Dcast-function-type -Wno-error=3Dcatch-value -Wno-error=3Dmultist=
atement-macros -Wno-error=3Drestrict -Wno-error=3Dsizeof-pointer-memaccess =
-Wno-error=3Dstringop-truncation -Wno-return-type -Wno-address-of-packed-me=
mber      -c /workspace/src/sys/contrib/dev/acpica/components/resources/rsi=
rq.c -o rsirq.o
--- all_subdir_usr.sbin/bhyve ---
/usr/local/bin/x86_64-unknown-freebsd13.1-ld: warning: libcap_grp.so.1, nee=
ded by /tmp/obj/workspace/src/amd64.amd64/tmp/usr/lib/lib9p.so, not found (=
try using -rpath or -rpath-link)
--- all_subdir_usr.bin ---
--- resizewin.1.gz ---
gzip -cn /workspace/src/usr.bin/resizewin/resizewin.1 > resizewin.1.gz
--- resizewin.full ---
/usr/local/bin/x86_64-unknown-freebsd13.1-gcc12 --sysroot=3D/tmp/obj/worksp=
ace/src/amd64.amd64/tmp -B/usr/local/x86_64-unknown-freebsd13.1/bin/ -O2 -p=
ipe -fno-common -fPIE -g -std=3Dgnu99 -Wno-format-zero-length -fstack-prote=
ctor-strong -Wsystem-headers -Werror -Wall -Wno-format-y2k -W -Wno-unused-p=
arameter -Wmissing-prototypes -Wpointer-arith -Wreturn-type -Wcast-qual -Ww=
rite-strings -Wswitch -Wshadow -Wunused-parameter -Wcast-align -Wchar-subsc=
ripts -Wnested-externs -Wold-style-definition -Wno-pointer-sign -Wdate-time=
 -Wno-error=3Daddress -Wno-error=3Darray-bounds -Wno-error=3Dattributes -Wn=
o-error=3Dbool-compare -Wno-error=3Dcast-align -Wno-error=3Dclobbered -Wno-=
error=3Ddeprecated-declarations -Wno-error=3Denum-compare -Wno-error=3Dextr=
a -Wno-error=3Dlogical-not-parentheses -Wno-error=3Dstrict-aliasing -Wno-er=
ror=3Duninitialized -Wno-error=3Dunused-but-set-variable -Wno-error=3Dunuse=
d-function -Wno-error=3Dunused-value -Wno-error=3Dempty-body -Wno-error=3Dm=
aybe-uninitialized -Wno-error=3Dnonnull-compare -Wno-error=3Dshift-negative=
-value -Wno-error=3Dtautological-compare -Wno-error=3Dunused-const-variable=
 -Wno-error=3Dbool-operation -Wno-error=3Ddeprecated -Wno-error=3Dexpansion=
-to-defined -Wno-error=3Dformat-overflow -Wno-error=3Dformat-truncation -Wn=
o-error=3Dimplicit-fallthrough -Wno-error=3Dint-in-bool-context -Wno-error=
=3Dmemset-elt-size -Wno-error=3Dnoexcept-type -Wno-error=3Dnonnull -Wno-err=
or=3Dpointer-compare -Wno-error=3Dstringop-overflow -Wno-error=3Daggressive=
-loop-optimizations -Wno-error=3Dcast-function-type -Wno-error=3Dcatch-valu=
e -Wno-error=3Dmultistatement-macros -Wno-error=3Drestrict -Wno-error=3Dsiz=
eof-pointer-memaccess -Wno-error=3Dstringop-truncation -Wno-return-type  -W=
l,-zrelro -pie   -o resizewin.full resizewin.o =20
--- all_subdir_usr.sbin ---
--- all_subdir_usr.sbin/acpi ---
--- rslist.o ---
/usr/local/bin/x86_64-unknown-freebsd13.1-gcc12 --sysroot=3D/tmp/obj/worksp=
ace/src/amd64.amd64/tmp -B/usr/local/x86_64-unknown-freebsd13.1/bin/  -O2 -=
pipe -fno-common -DACPI_DB_APP -DACPI_EXEC_APP -fno-strict-aliasing   -I/wo=
rkspace/src/sys -fPIE -g -MD  -MF.depend.rslist.o -MTrslist.o -std=3Dgnu99 =
-Wno-format-zero-length -fstack-protector-strong -Wsystem-headers -Werror -=
Wall -Wno-format-y2k -W -Wno-unused-parameter -Wmissing-prototypes -Wpointe=
r-arith -Wno-uninitialized -Wno-pointer-sign -Wdate-time -Wno-error=3Daddre=
ss -Wno-error=3Darray-bounds -Wno-error=3Dattributes -Wno-error=3Dbool-comp=
are -Wno-error=3Dcast-align -Wno-error=3Dclobbered -Wno-error=3Ddeprecated-=
declarations -Wno-error=3Denum-compare -Wno-error=3Dextra -Wno-error=3Dlogi=
cal-not-parentheses -Wno-error=3Dstrict-aliasing -Wno-error=3Duninitialized=
 -Wno-error=3Dunused-but-set-variable -Wno-error=3Dunused-function -Wno-err=
or=3Dunused-value -Wno-error=3Dempty-body -Wno-error=3Dmaybe-uninitialized =
-Wno-error=3Dnonnull-compare -Wno-error=3Dshift-negative-value -Wno-error=
=3Dtautological-compare -Wno-error=3Dunused-const-variable -Wno-error=3Dboo=
l-operation -Wno-error=3Ddeprecated -Wno-error=3Dexpansion-to-defined -Wno-=
error=3Dformat-overflow -Wno-error=3Dformat-truncation -Wno-error=3Dimplici=
t-fallthrough -Wno-error=3Dint-in-bool-context -Wno-error=3Dmemset-elt-size=
 -Wno-error=3Dnoexcept-type -Wno-error=3Dnonnull -Wno-error=3Dpointer-compa=
re -Wno-error=3Dstringop-overflow -Wno-error=3Daggressive-loop-optimization=
s -Wno-error=3Dcast-function-type -Wno-error=3Dcatch-value -Wno-error=3Dmul=
tistatement-macros -Wno-error=3Drestrict -Wno-error=3Dsizeof-pointer-memacc=
ess -Wno-error=3Dstringop-truncation -Wno-return-type -Wno-address-of-packe=
d-member      -c /workspace/src/sys/contrib/dev/acpica/components/resources=
/rslist.c -o rslist.o
--- all_subdir_usr.bin ---
--- resizewin.debug ---
/usr/local/x86_64-unknown-freebsd13.1/bin/objcopy --only-keep-debug resizew=
in.full resizewin.debug
--- resizewin ---
/usr/local/x86_64-unknown-freebsd13.1/bin/objcopy --strip-debug --add-gnu-d=
ebuglink=3Dresizewin.debug  resizewin.full resizewin
--- all_subdir_usr.bin/rev ---
=3D=3D=3D> usr.bin/rev (all)
--- all_subdir_usr.sbin ---
--- all_subdir_usr.sbin/bhyve ---
/usr/local/bin/x86_64-unknown-freebsd13.1-ld: /tmp/obj/workspace/src/amd64.=
amd64/tmp/usr/lib/lib9p.so: undefined reference to `cap_setpassent'
/usr/local/bin/x86_64-unknown-freebsd13.1-ld: /tmp/obj/workspace/src/amd64.=
amd64/tmp/usr/lib/lib9p.so: undefined reference to `cap_getgrgid_r'
/usr/local/bin/x86_64-unknown-freebsd13.1-ld: /tmp/obj/workspace/src/amd64.=
amd64/tmp/usr/lib/lib9p.so: undefined reference to `cap_setgroupent'
/usr/local/bin/x86_64-unknown-freebsd13.1-ld: /tmp/obj/workspace/src/amd64.=
amd64/tmp/usr/lib/lib9p.so: undefined reference to `cap_getpwnam'
/usr/local/bin/x86_64-unknown-freebsd13.1-ld: /tmp/obj/workspace/src/amd64.=
amd64/tmp/usr/lib/lib9p.so: undefined reference to `cap_getpwuid_r'
collect2: error: ld returned 1 exit status
*** [bhyve.full] Error code 1

make[4]: stopped in /workspace/src/usr.sbin/bhyve
--- all_subdir_tests ---

make[3]: stopped in /workspace/src/tests
--- all_subdir_usr.sbin ---

make[2]: stopped in /workspace/src
--- all_subdir_usr.bin ---

make[2]: stopped in /workspace/src
--- all_subdir_tests ---

make[2]: stopped in /workspace/src
--- all_subdir_lib ---

make[2]: stopped in /workspace/src
      166.35 real      1448.84 user       161.11 sys

make[1]: stopped in /workspace/src

make: stopped in /workspace/src
Build step 'Execute shell' marked build as failure
[WARNINGS]Skipping publisher since build result is FAILURE
[PostBuildScript] - [INFO] Executing post build scripts.
[FreeBSD-main-amd64-gcc12_build] $ /bin/sh -xe /tmp/jenkins8054295813768421=
651.sh
+ sh freebsd-ci/scripts/jail/clean.sh
clean jail FreeBSD-main-amd64-gcc12_build
Checking for post-build
Performing post-build step
Checking if email needs to be generated
Email was triggered for: Failure - Any
Sending email for trigger: Failure - Any
Sending mail from default account using System Admin e-mail address
------=_Part_354_1716408145.1678917012859--



Want to link to this message? Use this URL: <https://mail-archive.FreeBSD.org/cgi/mid.cgi?1217778326.355.1678917014690>