Date: Sun, 25 Feb 2024 22:03:42 +0000 (GMT) From: jenkins-admin@FreeBSD.org To: dim@FreeBSD.org, dev-ci@FreeBSD.org Cc: jenkins-admin@FreeBSD.org Subject: FreeBSD-main-amd64-test - Build #24793 - Still Unstable Message-ID: <260421521.2177.1708898622411@jenkins.ci.freebsd.org> In-Reply-To: <954506251.2153.1708893036671@jenkins.ci.freebsd.org> References: <954506251.2153.1708893036671@jenkins.ci.freebsd.org>
next in thread | previous in thread | raw e-mail | index | archive | help
FreeBSD-main-amd64-test - Build #24793 (470f9f13de10e47e6d45721c15af6b4abe7aad55) - Still Unstable Build information: https://ci.FreeBSD.org/job/FreeBSD-main-amd64-test/24793/ Full change log: https://ci.FreeBSD.org/job/FreeBSD-main-amd64-test/24793/changes Full build log: https://ci.FreeBSD.org/job/FreeBSD-main-amd64-test/24793/console Status explanation: "Unstable" - some tests are suspected being broken by the following changes "Still Unstable" - the failing test cases have not been fixed by these following changes and this is a notification to note that these changes have not been fully tested by the CI system Change summaries: (Those commits are likely but not certainly responsible) 470f9f13de10e47e6d45721c15af6b4abe7aad55 by dim: Build clang and other llvm executables as PIE The failed test cases: 3 tests failed. FAILED: sys.netinet6.test_ip6_output.py.TestIP6OutputMulticast::test_output6_multicast[ff08] Error Message: /usr/local/lib/python3.9/multiprocessing/connection.py:383: EOFError FAILED: sys.kern.fdgrowtable_test.oldtables_shared_via_threads Error Message: Test case body timed out FAILED: bin.ls.ls_tests.v_flag Error Message: atf-check failed; see the output of the test for details
Want to link to this message? Use this URL: <https://mail-archive.FreeBSD.org/cgi/mid.cgi?260421521.2177.1708898622411>
