Date: Mon, 6 Oct 2025 16:45:28 +0000 (GMT) From: jenkins-admin@FreeBSD.org To: jlduran@FreeBSD.org, dev-ci@FreeBSD.org Cc: jenkins-admin@FreeBSD.org Subject: FreeBSD-stable-15-amd64-test - Build #24 - Still unstable Message-ID: <393392887.269.1759769128687@jenkins.ci.freebsd.org> In-Reply-To: <796685046.243.1759743885982@jenkins.ci.freebsd.org> References: <796685046.243.1759743885982@jenkins.ci.freebsd.org>
next in thread | previous in thread | raw e-mail | index | archive | help
FreeBSD-stable-15-amd64-test - Build #24 (e4e196585cf341fe9f7f91bf2d6de5c1e0b92e43) - Still unstable Build information: https://ci.FreeBSD.org/job/FreeBSD-stable-15-amd64-test/24/ Full change log: https://ci.FreeBSD.org/job/FreeBSD-stable-15-amd64-test/24/changes Full build log: https://ci.FreeBSD.org/job/FreeBSD-stable-15-amd64-test/24/console Status explanation: "Unstable" - some tests are suspected being broken by the following changes "Still Unstable" - the failing test cases have not been fixed by these following changes and this is a notification to note that these changes have not been fully tested by the CI system Change summaries: (Those commits are likely but not certainly responsible) e4e196585cf341fe9f7f91bf2d6de5c1e0b92e43 by jlduran: release: packages: Fix grammar in pkg description The failed test cases: 10 tests failed. FAILED: sbin.ipfw.test_add_rule.py.TestAddRule::test_add_action[call_420] Error Message: /usr/tests/atf_python/sys/netpfil/ipfw/insns.py:105: ValueError FAILED: sbin.ipfw.test_add_rule.py.TestAddRule::test_add_action[return] Error Message: /usr/tests/atf_python/sys/netpfil/ipfw/insns.py:105: ValueError FAILED: sbin.ipfw.test_add_rule.py.TestAddRule::test_add_action[skipto_42] Error Message: /usr/tests/atf_python/sys/netpfil/ipfw/insns.py:105: ValueError FAILED: sbin.ipfw.test_add_rule.py.TestAddRule::test_add_rule[test_check_state] Error Message: /usr/tests/atf_python/sys/netpfil/ipfw/insns.py:105: ValueError FAILED: sbin.ipfw.test_add_rule.py.TestAddRule::test_add_rule[test_eaction_ntp] Error Message: /usr/tests/sbin/ipfw/test_add_rule.py:119: AssertionError FAILED: sbin.ipfw.test_add_rule.py.TestAddRule::test_add_rule[test_eaction_tcp-setmss] Error Message: /usr/tests/sbin/ipfw/test_add_rule.py:119: AssertionError FAILED: sbin.ipfw.test_add_rule.py.TestAddRule::test_add_rule[test_keep_state] Error Message: /usr/tests/atf_python/sys/netpfil/ipfw/insns.py:105: ValueError FAILED: sbin.ipfw.test_add_rule.py.TestAddRule::test_add_rule[test_record_state] Error Message: /usr/tests/atf_python/sys/netpfil/ipfw/insns.py:105: ValueError FAILED: sbin.ipfw.test_add_rule.py.TestAddRule::test_add_rule[test_tables] Error Message: /usr/tests/sbin/ipfw/test_add_rule.py:119: AssertionError FAILED: sys.netlink.test_netlink_message_writer.py.__test_cases_list__ Error Message: Test program did not exit cleanly
Want to link to this message? Use this URL: <https://mail-archive.FreeBSD.org/cgi/mid.cgi?393392887.269.1759769128687>
