Skip site navigation (1)Skip section navigation (2)
Date:      Mon, 2 Oct 2023 21:21:27 +0000 (GMT)
From:      jenkins-admin@FreeBSD.org
To:        bz@FreeBSD.org, andrew@FreeBSD.org, markj@FreeBSD.org, dev-ci@FreeBSD.org
Cc:        jenkins-admin@FreeBSD.org
Subject:   FreeBSD-main-amd64-test - Build #24195 - Still Unstable
Message-ID:  <832323526.5342.1696281688199@jenkins.ci.freebsd.org>
In-Reply-To: <307028408.5332.1696267323409@jenkins.ci.freebsd.org>
References:  <307028408.5332.1696267323409@jenkins.ci.freebsd.org>

next in thread | previous in thread | raw e-mail | index | archive | help

FreeBSD-main-amd64-test - Build #24195 (bd9588bca05f5cbdeac6e5f9f426b2589301d7c6) - Still Unstable

Build information: https://ci.FreeBSD.org/job/FreeBSD-main-amd64-test/24195/
Full change log: https://ci.FreeBSD.org/job/FreeBSD-main-amd64-test/24195/changes
Full build log: https://ci.FreeBSD.org/job/FreeBSD-main-amd64-test/24195/console

Status explanation:
"Unstable" - some tests are suspected being broken by the following changes
"Still Unstable" - the failing test cases have not been fixed by these
                   following changes and this is a notification to note that
                   these changes have not been fully tested by the CI system

Change summaries:
(Those commits are likely but not certainly responsible)

f156cd892b55c04a39fa06d1899e6e316de77f03 by bz:
net80211 / drivers: remove public use of ieee80211_node_incref()

7ea866eb14f8ec869a525442c03228b6701e1dab by markj:
nvme: Fix memory leak in pt ioctl commands

1bd9ca8b7548e5f573ae8186f3519f4bedff3a92 by andrew:
aarch64: support BTI and pointer authentication in assembly

41777819236110907dd4cff98ef70dfd0629f744 by andrew:
aarch64: fix branch target indications in arm64cpuid.pl and keccak1600

bd9588bca05f5cbdeac6e5f9f426b2589301d7c6 by andrew:
ossl: Rebuild the openssl asm



The failed test cases:

3 tests failed.
FAILED:  sys.net.if_ovpn.if_ovpn.ra

Error Message:
atf-check failed; see the output of the test for details

FAILED:  usr.bin.file.file_test.contrib_file_tests

Error Message:
atf-check failed; see the output of the test for details

FAILED:  sys.fs.tmpfs.times_test.empty

Error Message:
Incorrect atime

Want to link to this message? Use this URL: <https://mail-archive.FreeBSD.org/cgi/mid.cgi?832323526.5342.1696281688199>