Skip site navigation (1)Skip section navigation (2)
Date:      Mon, 6 Oct 2025 19:13:27 +0000 (GMT)
From:      jenkins-admin@FreeBSD.org
To:        jtl@FreeBSD.org, dev-ci@FreeBSD.org
Cc:        jenkins-admin@FreeBSD.org
Subject:   FreeBSD-stable-15-amd64-test - Build #25 - Still Unstable
Message-ID:  <371807733.281.1759778007436@jenkins.ci.freebsd.org>
In-Reply-To: <393392887.269.1759769128687@jenkins.ci.freebsd.org>
References:  <393392887.269.1759769128687@jenkins.ci.freebsd.org>

next in thread | previous in thread | raw e-mail | index | archive | help

FreeBSD-stable-15-amd64-test - Build #25 (a1f20ce8940363bab22839ab27fd32e87413987b) - Still Unstable

Build information: https://ci.FreeBSD.org/job/FreeBSD-stable-15-amd64-test/25/
Full change log: https://ci.FreeBSD.org/job/FreeBSD-stable-15-amd64-test/25/changes
Full build log: https://ci.FreeBSD.org/job/FreeBSD-stable-15-amd64-test/25/console

Status explanation:
"Unstable" - some tests are suspected being broken by the following changes
"Still Unstable" - the failing test cases have not been fixed by these
                   following changes and this is a notification to note that
                   these changes have not been fully tested by the CI system

Change summaries:
(Those commits are likely but not certainly responsible)

a1f20ce8940363bab22839ab27fd32e87413987b by jtl:
tcp: close two minor races with debug messages



The failed test cases:

14 tests failed.
FAILED:  lib.libregex.exhaust_test.regcomp_too_big

Error Message:
Empty test result or no new line

FAILED:  libexec.rc.rc_subr_test.wait_for_pids_progress

Error Message:
atf-check failed; see the output of the test for details

FAILED:  sys.netpfil.ipfw.divert.out_div

Error Message:
Test case body returned a non-ok exit code, but this is not allowed

FAILED:  sys.netpfil.pf.route_to.random_table

Error Message:
Target 2001:db8:4202::42:4 not selected after 10 attempts!

FAILED:  sbin.ipfw.test_add_rule.py.TestAddRule::test_add_action[call_420]

Error Message:
/usr/tests/atf_python/sys/netpfil/ipfw/insns.py:105: ValueError

FAILED:  sbin.ipfw.test_add_rule.py.TestAddRule::test_add_action[return]

Error Message:
/usr/tests/atf_python/sys/netpfil/ipfw/insns.py:105: ValueError

FAILED:  sbin.ipfw.test_add_rule.py.TestAddRule::test_add_action[skipto_42]

Error Message:
/usr/tests/atf_python/sys/netpfil/ipfw/insns.py:105: ValueError

FAILED:  sbin.ipfw.test_add_rule.py.TestAddRule::test_add_rule[test_check_state]

Error Message:
/usr/tests/atf_python/sys/netpfil/ipfw/insns.py:105: ValueError

FAILED:  sbin.ipfw.test_add_rule.py.TestAddRule::test_add_rule[test_eaction_ntp]

Error Message:
/usr/tests/sbin/ipfw/test_add_rule.py:119: AssertionError

FAILED:  sbin.ipfw.test_add_rule.py.TestAddRule::test_add_rule[test_eaction_tcp-setmss]

Error Message:
/usr/tests/sbin/ipfw/test_add_rule.py:119: AssertionError

FAILED:  sbin.ipfw.test_add_rule.py.TestAddRule::test_add_rule[test_keep_state]

Error Message:
/usr/tests/atf_python/sys/netpfil/ipfw/insns.py:105: ValueError

FAILED:  sbin.ipfw.test_add_rule.py.TestAddRule::test_add_rule[test_record_state]

Error Message:
/usr/tests/atf_python/sys/netpfil/ipfw/insns.py:105: ValueError

FAILED:  sbin.ipfw.test_add_rule.py.TestAddRule::test_add_rule[test_tables]

Error Message:
/usr/tests/sbin/ipfw/test_add_rule.py:119: AssertionError

FAILED:  sys.netlink.test_netlink_message_writer.py.__test_cases_list__

Error Message:
Test program did not exit cleanly

Want to link to this message? Use this URL: <https://mail-archive.FreeBSD.org/cgi/mid.cgi?371807733.281.1759778007436>