Skip site navigation (1)Skip section navigation (2)
Date:      Wed, 26 Mar 2025 17:23:08 +0000 (GMT)
From:      jenkins-admin@FreeBSD.org
To:        br@FreeBSD.org, olivier@FreeBSD.org, dev-ci@FreeBSD.org
Cc:        jenkins-admin@FreeBSD.org
Subject:   FreeBSD-main-amd64-test - Build #26139 - Still Unstable
Message-ID:  <1590376744.899.1743009788998@jenkins.ci.freebsd.org>
In-Reply-To: <404371439.887.1743003511953@jenkins.ci.freebsd.org>
References:  <404371439.887.1743003511953@jenkins.ci.freebsd.org>

next in thread | previous in thread | raw e-mail | index | archive | help
------=_Part_898_741299764.1743009788842
Content-Type: text/plain; charset=UTF-8
Content-Transfer-Encoding: 7bit

FreeBSD-main-amd64-test - Build #26139 (20bdda14fa5c7ccb96c814d09311db948b1d239a) - Still Unstable

Build information: https://ci.FreeBSD.org/job/FreeBSD-main-amd64-test/26139/
Full change log: https://ci.FreeBSD.org/job/FreeBSD-main-amd64-test/26139/changes
Full build log: https://ci.FreeBSD.org/job/FreeBSD-main-amd64-test/26139/console

Status explanation:
"Unstable" - some tests are suspected being broken by the following changes
"Still Unstable" - the failing test cases have not been fixed by these
                   following changes and this is a notification to note that
                   these changes have not been fully tested by the CI system

Change summaries:
(Those commits are likely but not certainly responsible)

c7ffe32b1b7de9d72add1b44d5d3a3a14605a8f0 by br:
xilinx quad spi: various fixes.

20bdda14fa5c7ccb96c814d09311db948b1d239a by olivier:
ps(1): Consistent usage of Kbyte unit



The failed test cases:

6 tests failed.
FAILED:  sys.kern.ptrace_test.ptrace__PT_KILL_competing_stop

Error Message:
/usr/src/tests/sys/kern/ptrace_test.c:2243: WIFSIGNALED(status) not met

FAILED:  sys.netinet6.ndp.ndp_del_gu_success

Error Message:
atf-check failed; see the output of the test for details

FAILED:  sys.kern.coredump_phnum_test.coredump_phnum

Error Message:
atf-check failed; see the output of the test for details

FAILED:  sys.kern.ktrace_test.ktrace__cap_sockaddr

Error Message:
/usr/src/tests/sys/kern/ktrace_test.c:133: WEXITSTATUS(error) != status

FAILED:  sys.netinet.broadcast.INADDR_BROADCAST

Error Message:
/usr/src/tests/sys/netinet/broadcast.c:65: sending of broadcast failed: 51

FAILED:  sys.netinet.fibs_test.same_ip_multiple_ifaces_fib0

Error Message:
atf-check failed; see the output of the test for details
------=_Part_898_741299764.1743009788842--



Want to link to this message? Use this URL: <https://mail-archive.FreeBSD.org/cgi/mid.cgi?1590376744.899.1743009788998>