Skip site navigation (1)Skip section navigation (2)
Date:      Mon, 24 Mar 2025 08:22:52 +0000 (GMT)
From:      jenkins-admin@FreeBSD.org
To:        kib@FreeBSD.org, dev-ci@FreeBSD.org
Cc:        jenkins-admin@FreeBSD.org
Subject:   FreeBSD-main-amd64-test - Build #26123 - Still unstable
Message-ID:  <289596631.597.1742804572747@jenkins.ci.freebsd.org>
In-Reply-To: <1356572275.573.1742794433289@jenkins.ci.freebsd.org>
References:  <1356572275.573.1742794433289@jenkins.ci.freebsd.org>

next in thread | previous in thread | raw e-mail | index | archive | help
------=_Part_596_663436020.1742804572585
Content-Type: text/plain; charset=UTF-8
Content-Transfer-Encoding: 7bit

FreeBSD-main-amd64-test - Build #26123 (c18a16ebcf5bf0bad19be10f58d9f42cbc079057) - Still unstable

Build information: https://ci.FreeBSD.org/job/FreeBSD-main-amd64-test/26123/
Full change log: https://ci.FreeBSD.org/job/FreeBSD-main-amd64-test/26123/changes
Full build log: https://ci.FreeBSD.org/job/FreeBSD-main-amd64-test/26123/console

Status explanation:
"Unstable" - some tests are suspected being broken by the following changes
"Still Unstable" - the failing test cases have not been fixed by these
                   following changes and this is a notification to note that
                   these changes have not been fully tested by the CI system

Change summaries:
(Those commits are likely but not certainly responsible)

c18a16ebcf5bf0bad19be10f58d9f42cbc079057 by kib:
kern_proc_kqueues_out(): maxlen == -1 means there is no maxlen



The failed test cases:

6 tests failed.
FAILED:  sys.kern.coredump_phnum_test.coredump_phnum

Error Message:
atf-check failed; see the output of the test for details

FAILED:  sys.netipsec.tunnel.empty.v4

Error Message:
atf-check failed; see the output of the test for details

FAILED:  sys.netipsec.tunnel.empty.v6

Error Message:
atf-check failed; see the output of the test for details

FAILED:  sys.kern.ktrace_test.ktrace__cap_sockaddr

Error Message:
/usr/src/tests/sys/kern/ktrace_test.c:133: WEXITSTATUS(error) != status

FAILED:  sys.netinet.broadcast.INADDR_BROADCAST

Error Message:
/usr/src/tests/sys/netinet/broadcast.c:65: sending of broadcast failed: 51

FAILED:  sys.netinet.fibs_test.same_ip_multiple_ifaces_fib0

Error Message:
atf-check failed; see the output of the test for details
------=_Part_596_663436020.1742804572585--



Want to link to this message? Use this URL: <https://mail-archive.FreeBSD.org/cgi/mid.cgi?289596631.597.1742804572747>