Date: Mon, 22 Sep 2025 08:16:57 +0000 (GMT) From: jenkins-admin@FreeBSD.org To: kib@FreeBSD.org, dev-ci@FreeBSD.org Cc: jenkins-admin@FreeBSD.org Subject: FreeBSD-stable-14-amd64-test - Build #1450 - Still Unstable Message-ID: <93540141.1029.1758529017647@jenkins.ci.freebsd.org> In-Reply-To: <1444421044.1017.1758524231631@jenkins.ci.freebsd.org> References: <1444421044.1017.1758524231631@jenkins.ci.freebsd.org>
next in thread | previous in thread | raw e-mail | index | archive | help
FreeBSD-stable-14-amd64-test - Build #1450 (ea4e916858ef29a29236b292c188d83eac5e1ebc) - Still Unstable Build information: https://ci.FreeBSD.org/job/FreeBSD-stable-14-amd64-test/1450/ Full change log: https://ci.FreeBSD.org/job/FreeBSD-stable-14-amd64-test/1450/changes Full build log: https://ci.FreeBSD.org/job/FreeBSD-stable-14-amd64-test/1450/console Status explanation: "Unstable" - some tests are suspected being broken by the following changes "Still Unstable" - the failing test cases have not been fixed by these following changes and this is a notification to note that these changes have not been fully tested by the CI system Change summaries: (Those commits are likely but not certainly responsible) ea4e916858ef29a29236b292c188d83eac5e1ebc by kib: iommu_get_requester(): make it more resilient against arbitrary dev arg The failed test cases: 3 tests failed. FAILED: sbin.ipfw.ipfw_test.__test_cases_list__ Error Message: Unknown test case metadata property 'require.kmods' FAILED: sys.netinet.fibs_test.same_ip_multiple_ifaces_fib0 Error Message: atf-check failed; see the output of the test for details FAILED: sys.netlink.test_netlink_message_writer.py.__test_cases_list__ Error Message: Test program did not exit cleanly
Want to link to this message? Use this URL: <https://mail-archive.FreeBSD.org/cgi/mid.cgi?93540141.1029.1758529017647>
