Skip site navigation (1)Skip section navigation (2)
Date:      Fri, 14 Feb 2025 03:51:42 +0000 (GMT)
From:      jenkins-admin@FreeBSD.org
To:        jhb@FreeBSD.org, kbowling@FreeBSD.org, dev-ci@FreeBSD.org
Cc:        jenkins-admin@FreeBSD.org
Subject:   FreeBSD-stable-14-amd64-test - Build #939 - Still Unstable
Message-ID:  <83771339.1427.1739505102653@jenkins.ci.freebsd.org>
In-Reply-To: <8104823.1347.1739460323742@jenkins.ci.freebsd.org>
References:  <8104823.1347.1739460323742@jenkins.ci.freebsd.org>

next in thread | previous in thread | raw e-mail | index | archive | help
------=_Part_1426_1796304066.1739505102142
Content-Type: text/plain; charset=UTF-8
Content-Transfer-Encoding: 7bit

FreeBSD-stable-14-amd64-test - Build #939 (0d1eed3701a836d0a8d0152619b1dccc96c810ba) - Still Unstable

Build information: https://ci.FreeBSD.org/job/FreeBSD-stable-14-amd64-test/939/
Full change log: https://ci.FreeBSD.org/job/FreeBSD-stable-14-amd64-test/939/changes
Full build log: https://ci.FreeBSD.org/job/FreeBSD-stable-14-amd64-test/939/console

Status explanation:
"Unstable" - some tests are suspected being broken by the following changes
"Still Unstable" - the failing test cases have not been fixed by these
                   following changes and this is a notification to note that
                   these changes have not been fully tested by the CI system

Change summaries:
(Those commits are likely but not certainly responsible)

ac2170b9955134c66f0e820b9dc1daa8f4d0e6a3 by jhb:
pac: Use strdup and asprintf in place of dubious string building

720d255477453f77b1200880db4b9e776327150e by jhb:
pac: Consistently use item count as the first argument to calloc

0d1eed3701a836d0a8d0152619b1dccc96c810ba by kbowling:
ixgbe: Add ixgbe_dev_from_hw() back



The failed test cases:

5 tests failed.
FAILED:  sbin.savecore.livedump_test.livedump_kldstat

Error Message:
atf-check failed; see the output of the test for details

FAILED:  sys.net.routing.test_routing_l3.py.TestIfOps::test_change_prefix_route[inet]

Error Message:
/usr/tests/sys/net/routing/test_routing_l3.py:42: AssertionError

FAILED:  usr.bin.grep.grep_test.recurse_symlink

Error Message:
atf-check failed; see the output of the test for details

FAILED:  sys.netmap.ctrl-api-test.main

Error Message:
Returned non-success exit status 255

FAILED:  sys.netlink.test_netlink_message_writer.py.__test_cases_list__

Error Message:
Test program did not exit cleanly
------=_Part_1426_1796304066.1739505102142--



Want to link to this message? Use this URL: <https://mail-archive.FreeBSD.org/cgi/mid.cgi?83771339.1427.1739505102653>