Skip site navigation (1)Skip section navigation (2)
Date:      Sun, 14 Jan 2018 07:25:30 +0000
From:      bugzilla-noreply@freebsd.org
To:        emulation@FreeBSD.org
Subject:   [Bug 214512] audio/linux-skype_oss_wrapper: gcc provided by CentOS is too old to understand some valid CPUTYPE
Message-ID:  <bug-214512-4077-BxGTrW3eSu@https.bugs.freebsd.org/bugzilla/>
In-Reply-To: <bug-214512-4077@https.bugs.freebsd.org/bugzilla/>
References:  <bug-214512-4077@https.bugs.freebsd.org/bugzilla/>

next in thread | previous in thread | raw e-mail | index | archive | help
https://bugs.freebsd.org/bugzilla/show_bug.cgi?id=3D214512

--- Comment #3 from Ting-Wei Lan <lantw44@gmail.com> ---
(In reply to w.schwarzenfeld from comment #2)
Yes, it is easy to reproduce the problem.

# make __MAKE_CONF=3D/dev/null CPUTYPE=3Dcorei7 BATCH=3D1
=3D=3D=3D>  License BSD3CLAUSE accepted by the user
=3D=3D=3D>   linux-skype_oss_wrapper-0.1.1 depends on file: /usr/local/sbin=
/pkg -
found
=3D=3D=3D> Fetching all distfiles required by linux-skype_oss_wrapper-0.1.1=
 for
building
=3D=3D=3D>  Extracting for linux-skype_oss_wrapper-0.1.1
=3D> SHA256 Checksum OK for s3erios-skype_oss_wrapper-v0.1.1_GH0.tar.gz.=20=
=20=20
=3D=3D=3D>  Patching for linux-skype_oss_wrapper-0.1.1
=3D=3D=3D>   linux-skype_oss_wrapper-0.1.1 depends on package: linux-c6-dev=
tools>0 -
found
=3D=3D=3D>  Configuring for linux-skype_oss_wrapper-0.1.1
=3D=3D=3D>  Building for linux-skype_oss_wrapper-0.1.1
--- skype_oss ---
--- libpulse.o ---
--- skype_oss ---
echo "#!/bin/sh" > skype_oss && echo
"LD_LIBRARY_PATH=3D/compat/linux/lib/skype_oss_wrapper:\$LD_LIBRARY_PATH sk=
ype"
>> skype_oss && chmod +x skype_oss
--- libpulse.o ---
/compat/linux/usr/bin/gcc -O2 -pipe -march=3Dcorei7  -fstack-protector
-fno-strict-aliasing -m32 -fPIC -c libpulse.c -o libpulse.o
libpulse.c:1: error: bad value (corei7) for -march=3D switch
libpulse.c:1: error: bad value (corei7) for -mtune=3D switch
*** [libpulse.o] Error code 1

make[1]: stopped in
/usr/ports/audio/linux-skype_oss_wrapper/work/skype_oss_wrapper-0.1.1
1 error

make[1]: stopped in
/usr/ports/audio/linux-skype_oss_wrapper/work/skype_oss_wrapper-0.1.1
=3D=3D=3D> Compilation failed unexpectedly.
Try to set MAKE_JOBS_UNSAFE=3Dyes and rebuild before reporting the failure =
to
the maintainer.
*** Error code 1

Stop.
make: stopped in /usr/ports/audio/linux-skype_oss_wrapper

--=20
You are receiving this mail because:
You are the assignee for the bug.=



Want to link to this message? Use this URL: <https://mail-archive.FreeBSD.org/cgi/mid.cgi?bug-214512-4077-BxGTrW3eSu>