Skip site navigation (1)Skip section navigation (2)
Date:      Sat, 29 Mar 2025 05:24:15 +0000 (GMT)
From:      jenkins-admin@FreeBSD.org
To:        jhibbits@FreeBSD.org, dev-ci@FreeBSD.org
Cc:        jenkins-admin@FreeBSD.org
Subject:   FreeBSD-main-amd64-test - Build #26166 - Still Unstable
Message-ID:  <2125147044.1249.1743225855474@jenkins.ci.freebsd.org>
In-Reply-To: <1957160165.1233.1743219553536@jenkins.ci.freebsd.org>
References:  <1957160165.1233.1743219553536@jenkins.ci.freebsd.org>

next in thread | previous in thread | raw e-mail | index | archive | help
------=_Part_1248_1017883556.1743225855284
Content-Type: text/plain; charset=UTF-8
Content-Transfer-Encoding: 7bit

FreeBSD-main-amd64-test - Build #26166 (7a4907250452de0818dcd4c084a138b03f153f55) - Still Unstable

Build information: https://ci.FreeBSD.org/job/FreeBSD-main-amd64-test/26166/
Full change log: https://ci.FreeBSD.org/job/FreeBSD-main-amd64-test/26166/changes
Full build log: https://ci.FreeBSD.org/job/FreeBSD-main-amd64-test/26166/console

Status explanation:
"Unstable" - some tests are suspected being broken by the following changes
"Still Unstable" - the failing test cases have not been fixed by these
                   following changes and this is a notification to note that
                   these changes have not been fully tested by the CI system

Change summaries:
(Those commits are likely but not certainly responsible)

7a4907250452de0818dcd4c084a138b03f153f55 by jhibbits:
powerpc/trap: Change prediction of NOFAULTING in trap_pfault()



The failed test cases:

9 tests failed.
FAILED:  lib.libc.net.getaddrinfo.getaddrinfo.basic

Error Message:
/usr/src/lib/libc/tests/net/getaddrinfo/getaddrinfo.c:94: Expected 0, got 2 (Name could not be resolved at this time)

FAILED:  lib.libc.net.getaddrinfo.getaddrinfo.nofamily

Error Message:
/usr/src/lib/libc/tests/net/getaddrinfo/getaddrinfo.c:224: Expected 1 (EAI_ADDRFAMILY), got 2 (Name could not be resolved at this time)

FAILED:  lib.libc.net.getaddrinfo.getaddrinfo_test.basic

Error Message:
Test case body returned a non-ok exit code, but this is not allowed

FAILED:  lib.libc.net.getaddrinfo.getaddrinfo_test.empty_servname

Error Message:
Test case body returned a non-ok exit code, but this is not allowed

FAILED:  lib.libc.net.getaddrinfo.getaddrinfo_test.sock_raw

Error Message:
Test case body returned a non-ok exit code, but this is not allowed

FAILED:  sys.kern.coredump_phnum_test.coredump_phnum

Error Message:
atf-check failed; see the output of the test for details

FAILED:  sys.kern.ktrace_test.ktrace__cap_sockaddr

Error Message:
/usr/src/tests/sys/kern/ktrace_test.c:133: WEXITSTATUS(error) != status

FAILED:  sys.netinet.broadcast.INADDR_BROADCAST

Error Message:
/usr/src/tests/sys/netinet/broadcast.c:65: sending of broadcast failed: 51

FAILED:  sys.netinet.fibs_test.same_ip_multiple_ifaces_fib0

Error Message:
atf-check failed; see the output of the test for details
------=_Part_1248_1017883556.1743225855284--



Want to link to this message? Use this URL: <https://mail-archive.FreeBSD.org/cgi/mid.cgi?2125147044.1249.1743225855474>