Date: Sun, 8 Nov 2015 19:08:40 +0000 (GMT) From: jenkins-admin@FreeBSD.org To: jenkins-admin@FreeBSD.org, freebsd-current@FreeBSD.org Subject: FreeBSD_HEAD-tests - Build #1675 - Unstable Message-ID: <1109003706.57.1447009720897.JavaMail.jenkins@jenkins-9.freebsd.org>
next in thread | raw e-mail | index | archive | help
FreeBSD_HEAD-tests - Build #1675 - Unstable: Build information: https://jenkins.FreeBSD.org/job/FreeBSD_HEAD-tests/1675/ Full change log: https://jenkins.FreeBSD.org/job/FreeBSD_HEAD-tests/1675/changes Full build log: https://jenkins.FreeBSD.org/job/FreeBSD_HEAD-tests/1675/console Change summaries: No changes The failed test cases: 6 tests failed. FAILED: bin.sh.builtins.functional_test.case7 Error Message: atf-check failed; see the output of the test for details FAILED: bin.sh.builtins.functional_test.locale1 Error Message: atf-check failed; see the output of the test for details FAILED: lib.libc.locale.c16rtomb_test.c16rtomb_test Error Message: Premature exit; test case received signal 11 (core dumped) FAILED: lib.libc.locale.mbrtoc16_test.mbrtoc16_test Error Message: Premature exit; test case received signal 11 (core dumped) FAILED: lib.libc.stdio.print_positional_test.__test_cases_list__ Error Message: Tester did not exit cleanly: kyua-atf-tester: Invalid test cases list header '1..4' FAILED: lib.libc.stdio.printfloat_test.thousands_separator_and_other_locale_tests Error Message: printf("%'.4f", 12345678.0625) ==> [1,23,45,678.0625], expected [123,456,78.0625]<<NEWLINE>>
Want to link to this message? Use this URL: <https://mail-archive.FreeBSD.org/cgi/mid.cgi?1109003706.57.1447009720897.JavaMail.jenkins>