Skip site navigation (1)Skip section navigation (2)
Date:      Tue, 25 Apr 2023 20:26:09 +0000 (GMT)
From:      jenkins-admin@FreeBSD.org
To:        markj@FreeBSD.org, mjg@FreeBSD.org, dim@FreeBSD.org, dev-ci@FreeBSD.org
Cc:        jenkins-admin@FreeBSD.org
Subject:   FreeBSD-main-amd64-test - Build #23424 - Still Unstable
Message-ID:  <1892155595.2825.1682454370190@jenkins.ci.freebsd.org>
In-Reply-To: <515423039.2821.1682447719737@jenkins.ci.freebsd.org>
References:  <515423039.2821.1682447719737@jenkins.ci.freebsd.org>

next in thread | previous in thread | raw e-mail | index | archive | help

FreeBSD-main-amd64-test - Build #23424 (3029b0b0e9d68eb54e3bdd9e3e49e0f0d2d57835) - Still Unstable

Build information: https://ci.FreeBSD.org/job/FreeBSD-main-amd64-test/23424/
Full change log: https://ci.FreeBSD.org/job/FreeBSD-main-amd64-test/23424/changes
Full build log: https://ci.FreeBSD.org/job/FreeBSD-main-amd64-test/23424/console

Status explanation:
"Unstable" - some tests are suspected being broken by the following changes
"Still Unstable" - the failing test cases have not been fixed by these
                   following changes and this is a notification to note that
                   these changes have not been fully tested by the CI system

Change summaries:
(Those commits are likely but not certainly responsible)

b0695c6abe3f33a4188bcbcbf214823cd86f54d6 by mjg:
zfs: Revert "Fix data race between zil_commit() and zil_suspend()"

bab8274c090942cf96c44bc001307b9bffac9d7e by dim:
Use bool for one-bit wide bit-fields

47cf1b37f42d2acb24fa3a1e6106374dddb3edbf by markj:
vmm: Expose some more AVX512 CPUID bits to guests

64b5d74fffc8882d915e6e8de7e5fc893c606213 by dim:
zfs: make zfs_vfs_held() definition consistent with declaration

f74be55e3045793a507d98127faf9aabd918e1ce by dim:
vm: fix a number of functions to match the expected prototypes

3029b0b0e9d68eb54e3bdd9e3e49e0f0d2d57835 by dim:
boolean_t: change to unsigned int to avoid signed bitfield warnings



The failed test cases:

4 tests failed.
FAILED:  sys.netinet.arp.arp_del_success

Error Message:
atf-check failed; see the output of the test for details

FAILED:  sys.netinet6.proxy_ndp.pndp_add_gu_success

Error Message:
atf-check failed; see the output of the test for details

FAILED:  sys.netinet6.proxy_ndp.pndp_neighbor_advert

Error Message:
atf-check failed; see the output of the test for details

FAILED:  sys.netlink.test_snl.snl_parse_errmsg_capped

Error Message:
1 checks failed; see output for more details

Want to link to this message? Use this URL: <https://mail-archive.FreeBSD.org/cgi/mid.cgi?1892155595.2825.1682454370190>