Skip site navigation (1)Skip section navigation (2)
Date:      Fri, 21 Mar 2025 00:18:44 +0000 (GMT)
From:      jenkins-admin@FreeBSD.org
To:        dumbbell@FreeBSD.org, dev-ci@FreeBSD.org
Cc:        jenkins-admin@FreeBSD.org
Subject:   FreeBSD-main-amd64-test - Build #26104 - Still Unstable
Message-ID:  <444594679.277.1742516324638@jenkins.ci.freebsd.org>
In-Reply-To: <174342910.273.1742509904947@jenkins.ci.freebsd.org>
References:  <174342910.273.1742509904947@jenkins.ci.freebsd.org>

next in thread | previous in thread | raw e-mail | index | archive | help
------=_Part_276_135091081.1742516324471
Content-Type: text/plain; charset=UTF-8
Content-Transfer-Encoding: 7bit

FreeBSD-main-amd64-test - Build #26104 (cd8c2e012761bf672074798be64d5ce16af7aff8) - Still Unstable

Build information: https://ci.FreeBSD.org/job/FreeBSD-main-amd64-test/26104/
Full change log: https://ci.FreeBSD.org/job/FreeBSD-main-amd64-test/26104/changes
Full build log: https://ci.FreeBSD.org/job/FreeBSD-main-amd64-test/26104/console

Status explanation:
"Unstable" - some tests are suspected being broken by the following changes
"Still Unstable" - the failing test cases have not been fixed by these
                   following changes and this is a notification to note that
                   these changes have not been fully tested by the CI system

Change summaries:
(Those commits are likely but not certainly responsible)

039eac2463d7b0b1b863a57c78cb2e054c210197 by dumbbell:
linuxkpi: Add `strim()`

09ba3ece18177c6ed96f8be75c6d648e9d20acdf by dumbbell:
linuxkpi: Add `list_for_each_rcu()`

3f847ccfd51edd0640cc892424a76a7460c353e8 by dumbbell:
linuxkpi: Define a few more `PCI_*` constants

62f2367e2aac46194e4f97ff64ab32b82e4b8649 by dumbbell:
linuxkpi: Add <linux/units.h>

cd8c2e012761bf672074798be64d5ce16af7aff8 by dumbbell:
linuxkpi: Add <linux/cpufeature.h>



The failed test cases:

7 tests failed.
FAILED:  sys.kern.coredump_phnum_test.coredump_phnum

Error Message:
atf-check failed; see the output of the test for details

FAILED:  sys.netipsec.tunnel.empty.v4

Error Message:
atf-check failed; see the output of the test for details

FAILED:  sys.netipsec.tunnel.empty.v6

Error Message:
atf-check failed; see the output of the test for details

FAILED:  sys.kern.ktrace_test.ktrace__cap_sockaddr

Error Message:
/usr/src/tests/sys/kern/ktrace_test.c:133: WEXITSTATUS(error) != status

FAILED:  sys.netinet.broadcast.INADDR_BROADCAST

Error Message:
/usr/src/tests/sys/netinet/broadcast.c:65: sending of broadcast failed: 51

FAILED:  sys.netinet.carp.unicast_v4

Error Message:
atf-check failed; see the output of the test for details

FAILED:  sys.netinet.fibs_test.same_ip_multiple_ifaces_fib0

Error Message:
atf-check failed; see the output of the test for details
------=_Part_276_135091081.1742516324471--



Want to link to this message? Use this URL: <https://mail-archive.FreeBSD.org/cgi/mid.cgi?444594679.277.1742516324638>