Skip site navigation (1)Skip section navigation (2)
Date:      Tue, 7 Oct 2025 06:30:20 +0000 (GMT)
From:      jenkins-admin@FreeBSD.org
To:        cperciva@FreeBSD.org, dev-ci@FreeBSD.org
Cc:        jenkins-admin@FreeBSD.org
Subject:   FreeBSD-stable-15-amd64-test - Build #27 - Still Unstable
Message-ID:  <1665499994.375.1759818621092@jenkins.ci.freebsd.org>
In-Reply-To: <2185998.367.1759811265554@jenkins.ci.freebsd.org>
References:  <2185998.367.1759811265554@jenkins.ci.freebsd.org>

next in thread | previous in thread | raw e-mail | index | archive | help

FreeBSD-stable-15-amd64-test - Build #27 (fc601f0ba8053896a4b67749d8e2a005d4c316b3) - Still Unstable

Build information: https://ci.FreeBSD.org/job/FreeBSD-stable-15-amd64-test/27/
Full change log: https://ci.FreeBSD.org/job/FreeBSD-stable-15-amd64-test/27/changes
Full build log: https://ci.FreeBSD.org/job/FreeBSD-stable-15-amd64-test/27/console

Status explanation:
"Unstable" - some tests are suspected being broken by the following changes
"Still Unstable" - the failing test cases have not been fixed by these
                   following changes and this is a notification to note that
                   these changes have not been fully tested by the CI system

Change summaries:
(Those commits are likely but not certainly responsible)

4a62dbb24598b5fbfd10575ec33233c24dca2705 by cperciva:
release: Respect NODISTSETS

224d3a6576352a34c13c55fa099314e5018b7649 by cperciva:
release: Don't publish pkgbase.repo for embedded

fc601f0ba8053896a4b67749d8e2a005d4c316b3 by cperciva:
release: Check for empty NODISTSETS



The failed test cases:

10 tests failed.
FAILED:  sbin.ipfw.test_add_rule.py.TestAddRule::test_add_action[call_420]

Error Message:
/usr/tests/atf_python/sys/netpfil/ipfw/insns.py:105: ValueError

FAILED:  sbin.ipfw.test_add_rule.py.TestAddRule::test_add_action[return]

Error Message:
/usr/tests/atf_python/sys/netpfil/ipfw/insns.py:105: ValueError

FAILED:  sbin.ipfw.test_add_rule.py.TestAddRule::test_add_action[skipto_42]

Error Message:
/usr/tests/atf_python/sys/netpfil/ipfw/insns.py:105: ValueError

FAILED:  sbin.ipfw.test_add_rule.py.TestAddRule::test_add_rule[test_check_state]

Error Message:
/usr/tests/atf_python/sys/netpfil/ipfw/insns.py:105: ValueError

FAILED:  sbin.ipfw.test_add_rule.py.TestAddRule::test_add_rule[test_eaction_ntp]

Error Message:
/usr/tests/sbin/ipfw/test_add_rule.py:119: AssertionError

FAILED:  sbin.ipfw.test_add_rule.py.TestAddRule::test_add_rule[test_eaction_tcp-setmss]

Error Message:
/usr/tests/sbin/ipfw/test_add_rule.py:119: AssertionError

FAILED:  sbin.ipfw.test_add_rule.py.TestAddRule::test_add_rule[test_keep_state]

Error Message:
/usr/tests/atf_python/sys/netpfil/ipfw/insns.py:105: ValueError

FAILED:  sbin.ipfw.test_add_rule.py.TestAddRule::test_add_rule[test_record_state]

Error Message:
/usr/tests/atf_python/sys/netpfil/ipfw/insns.py:105: ValueError

FAILED:  sbin.ipfw.test_add_rule.py.TestAddRule::test_add_rule[test_tables]

Error Message:
/usr/tests/sbin/ipfw/test_add_rule.py:119: AssertionError

FAILED:  sys.netlink.test_netlink_message_writer.py.__test_cases_list__

Error Message:
Test program did not exit cleanly

Want to link to this message? Use this URL: <https://mail-archive.FreeBSD.org/cgi/mid.cgi?1665499994.375.1759818621092>