Date: Sat, 18 Jun 2022 01:13:42 +0000 (GMT) From: jenkins-admin@FreeBSD.org To: rmacklem@FreeBSD.org, dev-ci@FreeBSD.org Cc: jenkins-admin@FreeBSD.org Subject: FreeBSD-main-amd64-test - Build #21463 - Still Unstable Message-ID: <791832529.513.1655514822722@jenkins.ci.freebsd.org> In-Reply-To: <393432914.491.1655505014238@jenkins.ci.freebsd.org> References: <393432914.491.1655505014238@jenkins.ci.freebsd.org>
next in thread | previous in thread | raw e-mail | index | archive | help
------=_Part_512_1675862897.1655514822420 Content-Type: text/plain; charset=UTF-8 Content-Transfer-Encoding: 7bit FreeBSD-main-amd64-test - Build #21463 (1e70163c50847f0b48659ab006b70b33e2fcd926) - Still Unstable Build information: https://ci.FreeBSD.org/job/FreeBSD-main-amd64-test/21463/ Full change log: https://ci.FreeBSD.org/job/FreeBSD-main-amd64-test/21463/changes Full build log: https://ci.FreeBSD.org/job/FreeBSD-main-amd64-test/21463/console Status explanation: "Unstable" - some tests are suspected being broken by the following changes "Still Unstable" - the failing test cases have not been fixed by these following changes and this is a notification to note that these changes have not been fully tested by the CI system Change summaries: (Those commits are likely but not certainly responsible) 1e70163c50847f0b48659ab006b70b33e2fcd926 by rmacklem: nfscl: Clean up the code by removing unused arguments The failed test cases: 3 tests failed. FAILED: sbin.growfs.legacy_test.main Error Message: 6 of 19 tests failed FAILED: sys.geom.class.eli.resize_test.resize Error Message: atf-check failed; see the output of the test for details FAILED: usr.sbin.makefs.makefs_ffs_tests.autocalculate_image_size Error Message: atf-check failed; see the output of the test for details ------=_Part_512_1675862897.1655514822420--
Want to link to this message? Use this URL: <https://mail-archive.FreeBSD.org/cgi/mid.cgi?791832529.513.1655514822722>