Skip site navigation (1)Skip section navigation (2)
Date:      Sat, 18 Jun 2022 11:49:26 +0000 (GMT)
From:      jenkins-admin@FreeBSD.org
To:        kib@FreeBSD.org, dev-ci@FreeBSD.org
Cc:        jenkins-admin@FreeBSD.org
Subject:   FreeBSD-main-amd64-test - Build #21467 - Still Unstable
Message-ID:  <109470948.567.1655552966566@jenkins.ci.freebsd.org>
In-Reply-To: <991786159.553.1655532805332@jenkins.ci.freebsd.org>
References:  <991786159.553.1655532805332@jenkins.ci.freebsd.org>

next in thread | previous in thread | raw e-mail | index | archive | help
------=_Part_566_1176129033.1655552966017
Content-Type: text/plain; charset=UTF-8
Content-Transfer-Encoding: 7bit

FreeBSD-main-amd64-test - Build #21467 (8c309d48aabf1cb469334c7716033f177a2715c0) - Still Unstable

Build information: https://ci.FreeBSD.org/job/FreeBSD-main-amd64-test/21467/
Full change log: https://ci.FreeBSD.org/job/FreeBSD-main-amd64-test/21467/changes
Full build log: https://ci.FreeBSD.org/job/FreeBSD-main-amd64-test/21467/console

Status explanation:
"Unstable" - some tests are suspected being broken by the following changes
"Still Unstable" - the failing test cases have not been fixed by these
                   following changes and this is a notification to note that
                   these changes have not been fully tested by the CI system

Change summaries:
(Those commits are likely but not certainly responsible)

8ae769491303715c68e79aaf0e4e2f5c639151f9 by kib:
KERN_LOCKF: report kl_file_fsid consistently with stat(2)

8c309d48aabf1cb469334c7716033f177a2715c0 by kib:
struct kinfo_file changes needed for lsof to work using only usermode



The failed test cases:

4 tests failed.
FAILED:  sys.kern.ptrace_test.ptrace__parent_sees_exit_after_child_debugger

Error Message:
/usr/src/tests/sys/kern/ptrace_test.c:363: WEXITSTATUS(status) (32) == 0 (0) not met

FAILED:  sbin.growfs.legacy_test.main

Error Message:
6 of 19 tests failed

FAILED:  sys.geom.class.eli.resize_test.resize

Error Message:
atf-check failed; see the output of the test for details

FAILED:  usr.sbin.makefs.makefs_ffs_tests.autocalculate_image_size

Error Message:
atf-check failed; see the output of the test for details
------=_Part_566_1176129033.1655552966017--



Want to link to this message? Use this URL: <https://mail-archive.FreeBSD.org/cgi/mid.cgi?109470948.567.1655552966566>