Skip site navigation (1)Skip section navigation (2)
Date:      Tue, 21 Jun 2022 06:45:02 +0000 (GMT)
From:      jenkins-admin@FreeBSD.org
To:        alc@FreeBSD.org, dev-ci@FreeBSD.org
Cc:        jenkins-admin@FreeBSD.org
Subject:   FreeBSD-main-amd64-test - Build #21483 - Still Unstable
Message-ID:  <1016112441.799.1655793902606@jenkins.ci.freebsd.org>
In-Reply-To: <1717715968.769.1655780075035@jenkins.ci.freebsd.org>
References:  <1717715968.769.1655780075035@jenkins.ci.freebsd.org>

next in thread | previous in thread | raw e-mail | index | archive | help
------=_Part_798_177943385.1655793902109
Content-Type: text/plain; charset=UTF-8
Content-Transfer-Encoding: 7bit

FreeBSD-main-amd64-test - Build #21483 (32e82bcc152783dfe0d03ffdd864cedfddbc80d7) - Still Unstable

Build information: https://ci.FreeBSD.org/job/FreeBSD-main-amd64-test/21483/
Full change log: https://ci.FreeBSD.org/job/FreeBSD-main-amd64-test/21483/changes
Full build log: https://ci.FreeBSD.org/job/FreeBSD-main-amd64-test/21483/console

Status explanation:
"Unstable" - some tests are suspected being broken by the following changes
"Still Unstable" - the failing test cases have not been fixed by these
                   following changes and this is a notification to note that
                   these changes have not been fully tested by the CI system

Change summaries:
(Those commits are likely but not certainly responsible)

32e82bcc152783dfe0d03ffdd864cedfddbc80d7 by alc:
busdma_iommu: Eliminate a redundant trunc_page()



The failed test cases:

3 tests failed.
FAILED:  sbin.growfs.legacy_test.main

Error Message:
6 of 19 tests failed

FAILED:  sys.geom.class.eli.resize_test.resize

Error Message:
atf-check failed; see the output of the test for details

FAILED:  usr.sbin.makefs.makefs_ffs_tests.autocalculate_image_size

Error Message:
atf-check failed; see the output of the test for details
------=_Part_798_177943385.1655793902109--



Want to link to this message? Use this URL: <https://mail-archive.FreeBSD.org/cgi/mid.cgi?1016112441.799.1655793902606>